program: Gaussian 09
title: 000292148
version: EM64L-G09RevD.01
frameworkgroup: C1[X(C6H7N3O2)]
method: RPBEPBE
basis: SDD
operation: Freq
keyword: #pfreq=noraman
keyword: PBEPBE/SDD
title: #p freq=noraman PBEPBE/SDD
converged: NO YES NO NO
title: Mulliken charges:
elementType: O O N N N C C C C C C H H H H H H H
charge: -0.196559 -0.221828 -0.407409 -0.021024 -0.621862 0.442370 -0.043830 0.125589 -0.463333 -0.780028 0.159320 0.341065 0.253238 0.249441 0.255226 0.250981 0.330084 0.348558
chargesum: 0.00000
title: Mulliken charges with hydrogens summed into heavy atoms:
elementType: O O N N N C C C C C C
charge: -0.196559 -0.221828 -0.066344 -0.021024 0.056780 0.442370 -0.043830 0.125589 -0.210095 -0.024379 0.159320
polarizability: 1.40017119e+02 -6.83931098e+00 1.04678003e+02 3.92741421e-02 1.41233765e-02 4.24362992e+01
1716.lowfreq: -3.2021 -0.0009 0.0004 0.0007 3.3204 5.2935 35.5023 78.3464 118.7905
frequency: 35.4798 78.3379 118.7799 158.7372 185.6516 285.0794 286.1046 339.8128 378.8028 446.7018 520.3777 526.6560 551.2710 584.5805 593.0822 660.0603 670.2007 692.3473 704.1853 777.8880 808.1308 842.0894 961.5335 1017.1927 1030.4906 1047.0845 1056.9834 1165.8558 1209.6857 1238.2814 1347.1605 1361.4389 1403.0585 1416.9465 1465.5056 1466.0814 1499.3538 1541.8416 1575.3702 1609.0461 1661.6664 2984.6227 3063.1162 3114.7043 3179.6744 3481.7682 3499.9566 3676.3159
redmass: 8.8655 3.1861 1.1648 4.3930 5.4637 3.9271 4.2046 4.4519 6.6927 4.2574 5.8402 3.9393 1.3743 6.7781 3.0806 1.0990 4.8002 3.7040 6.9842 1.5554 5.7745 1.3025 2.5602 3.2206 2.6193 1.5363 2.1914 5.0175 4.7146 1.6930 3.0411 1.7226 1.2736 3.0977 1.1483 1.2309 4.1053 1.3998 3.8135 4.7103 7.4093 1.0385 1.0981 1.0976 1.0933 1.0776 1.0454 1.1034
irintensity: 0.6642 8.2329 0.2141 0.6518 9.1327 1.5867 0.6786 4.2663 12.3429 12.4306 10.3854 3.0636 138.5714 5.7751 32.2850 106.3425 3.3245 41.0512 4.2618 50.8918 44.0856 24.1994 8.5176 4.1857 3.4555 16.3458 1.8846 46.9689 37.4213 12.5027 87.9960 25.5706 51.4090 79.4705 19.3031 20.2809 11.0818 175.9364 129.0380 35.3413 507.3136 16.7346 9.9504 9.0287 12.4368 44.8564 34.7847 67.5923
temp: 298.150 k
press: 1.00000 atm
elementType: 8 8 7 7 7 6 6 6 6 6 6 1 1 1 1 1 1 1
symmnumber: 1
zpe: 348825.6 jmol-1
zpe.correction: 0.132861 hartree
zpe.thermalcorrener: 0.143021 hartree
zpe.thermalcorrenthalpy: 0.143966 hartree
zpe.thermalcorrgfe: 0.096504 hartree
zpe.sumelectzpe: -546.753850 hartree
zpe.sumelectthermal: -546.743689 hartree
zpe.sumelectthermalent: -546.742745 hartree
zpe.sumelectthermalfe: -546.790206 hartree
dipole: 7.1202 -4.4398 0.0110
dipole: 8.3910
quadrupole: -51.9288 -67.3650 -64.5973
quadrupole: 13.8549 0.0399 0.0391
quadrupole: 9.3682 -6.0680 -3.3002 13.8549 0.0399 0.0391
hfenergy: -546.8867103 hartree
pointgroup: C01 [X(C6H7N3O2)]
dipole: -2.7235753 -1.8288551 0.3686234 debye
dipolederiv: -0.3430925 -0.0919647 0.0329365 -0.3057853 -1.0952874 0.2305135 0.1071661 0.2504665 -0.4268139 -0.7675414 -0.2842326 0.056317 -0.0285215 -0.6996255 0.1207226 -0.0306188 0.0966089 -0.3763265 -0.3872509 -0.5629389 0.1873766 0.327242 -0.4832056 0.0986218 -0.1279175 0.0111879 -0.3079976 0.3623552 0.2282924 -0.0273478 0.3728937 -0.1603221 0.0296324 -0.0784519 0.0163432 -0.1920151 -0.688892 0.4039804 -0.1367546 0.3613427 -0.9065236 0.1043543 -0.1198675 0.1070059 -0.7486864 0.5724401 0.1652557 -0.0117728 -0.811011 0.4335104 -0.1881922 0.3393455 -0.0926524 0.1924384 -0.2140753 0.1793874 -0.0889803 -0.5774233 -0.2883458 0.0589086 0.1772846 0.1324365 0.0138463 0.3416618 0.4088108 -0.1365583 0.4900591 1.2438791 -0.2835831 -0.165348 -0.2900658 0.3747363 -0.8460276 -0.0935587 -0.0321146 0.5167181 0.0691896 -0.0410149 -0.2452928 -0.0997268 -0.1788583 -0.2154861 -0.0551966 -0.0070796 0.0940094 0.0265679 0.0149256 -0.0720022 0.0003068 0.0333997 1.3689859 -0.1271145 0.1575151 -0.2270007 1.1660067 -0.3526918 0.1895738 -0.3453778 0.3420051 0.191432 -0.0203477 -0.0042699 -0.0184236 0.1866092 0.0408207 -0.0044698 0.0394307 0.2934669 0.0174841 -0.0682589 0.0093319 -0.0935466 0.0079613 0.0490438 0.0182047 0.0512113 0.1564563 -0.0023274 0.0316538 0.0250447 0.0762544 -0.0016545 -0.0945026 0.0718163 -0.0798603 0.0642327 0.0811668 -0.0017934 -0.0038742 -0.0942231 -0.0575322 0.0613359 0.0317877 0.0695319 0.1058712 0.0184522 -0.0047461 -0.0312141 -0.0036872 0.1146846 0.0471119 -0.0901842 0.0294822 -0.0734162 0.181164 -0.0408131 -0.0071048 -0.0262218 0.2139543 0.0584707 -0.013782 0.0582393 0.3680097 0.3295511 -0.0664152 0.0185492 -0.0526753 0.2301335 0.0455227 0.0127558 0.0454321 0.3596514 unknown
polarizability: 138.6444313|10.5675778|98.9355243|5.7453562|-18.7275685|49.551466 unknown
InChI: InChI=1S/C6H7N3O2/c1-3-2-8-4(5(7)10)6(11)9-3/h2,9H,7H2,1H3
charge 0 multiplicity 1
18 atoms
O  0.275344 2.428385 -0.605661
O  2.856438 1.1932 0.078445
N  -1.537049 1.000442 -0.287925
N  0.064187 -1.041759 0.588064
N  2.705867 -1.013393 0.826977
C  -2.142043 -0.185228 0.07097
C  0.652854 0.113946 0.236737
C  -0.115946 1.288102 -0.248318
C  -1.300217 -1.207924 0.51526
C  -3.640842 -0.297713 -0.040652
C  2.165183 0.172077 0.364261
H  -2.101259 1.791629 -0.621901
H  -1.704941 -2.175301 0.817753
H  -4.147364 0.468275 0.57584
H  -3.978402 -1.288448 0.300333
H  -3.975227 -0.163367 -1.086539
H  3.713562 -1.076207 0.952724
H  2.080557 -1.792616 1.039032
