program: Gaussian 09
title: 000292153
version: EM64L-G09RevD.01
frameworkgroup: C1[X(C8H9NO4S)]
method: RPBEPBE
basis: SDD
operation: Freq
keyword: #p
keyword: freq=noraman
keyword: PBEPBE/SDD
title: #p freq=noraman PBEPBE/SDD
converged: NO YES NO NO
title: Mulliken charges:
elementType: S O O O O N C C C C C C C C H H H H H H H H H
charge: 0.320072 -0.269858 -0.246342 -0.205662 -0.210379 0.031321 -0.170790 0.369270 -0.257308 -0.294923 -0.709810 0.301922 -0.218578 -0.669957 0.323361 0.266102 0.266094 0.226010 0.233711 0.233710 0.215770 0.233133 0.233132
chargesum: 0.00000
title: Mulliken charges with hydrogens summed into heavy atoms:
elementType: S O O O O N C C C C C C C C
charge: 0.320072 -0.269858 -0.246342 -0.205662 -0.210379 0.031321 -0.170790 0.369270 -0.257308 0.028438 0.048395 0.301922 0.248843 0.012078
polarizability: 1.93127501e+02 1.39979626e+00 1.45476357e+02 1.13070559e-03 -9.44835065e-04 6.21432016e+01
1716.lowfreq: -12.1791 -6.4241 -3.3805 -0.0022 -0.0020 0.0022 26.9181 52.5895 66.5818
frequency: 26.9147 52.5849 66.5769 71.7557 80.1776 139.4284 144.9310 158.2462 180.2767 227.8800 242.0097 280.0074 294.6687 310.1587 342.8419 375.3571 434.7550 473.5777 489.5762 564.6766 646.5130 686.3339 702.1611 702.8890 719.1136 750.9054 798.8614 810.7710 848.4057 918.1226 991.5033 1016.4999 1026.9670 1055.3582 1112.3773 1133.9664 1143.3038 1172.9593 1215.2139 1237.4532 1248.5459 1331.6569 1359.2263 1370.9730 1400.2678 1402.1465 1441.9626 1458.2715 1462.3356 1473.1188 1485.4623 1509.2464 1544.5217 1617.5246 2994.7463 2998.3938 3012.4511 3072.3948 3075.9040 3094.8773 3104.5506 3111.5897 3222.3361
redmass: 2.9374 6.7591 5.0371 4.0775 3.9535 1.1848 2.4602 5.9340 6.0168 5.2472 1.2748 5.7472 5.1573 4.7672 5.2155 6.7623 9.0828 5.6553 7.1223 5.0435 6.3610 6.1193 8.0789 7.4952 9.9246 8.7130 1.1007 3.7809 4.0902 1.3970 3.1695 1.4281 2.6645 2.8648 2.2320 1.4575 1.8310 2.8175 11.7120 6.0266 1.1360 4.7199 1.8327 4.5204 1.2662 1.1909 1.0444 1.0908 1.0401 1.0656 1.0716 10.0659 7.9144 11.3876 1.0364 1.0359 1.0581 1.1070 1.0961 1.0984 1.1011 1.1027 1.0959
irintensity: 0.9423 0.0525 1.8227 3.9350 0.0718 0.5963 2.0949 4.9210 9.2890 0.9772 0.5938 3.6356 2.2946 2.3635 7.8589 4.1356 1.5824 5.3294 1.8618 0.5154 10.2348 5.7302 14.0904 30.6260 0.0429 2.0066 3.2911 4.5476 0.2149 22.3524 62.7343 3.4992 143.9974 136.4441 2.5025 5.9068 83.6124 63.7225 339.1425 204.4748 0.0186 163.5743 42.3998 45.4237 24.1252 9.7598 16.1765 11.4802 12.9801 7.2441 12.1806 98.7224 15.9142 257.8674 2.4737 18.0758 18.1905 7.5739 2.9759 26.7467 13.3711 40.4447 10.9609
temp: 298.150 k
press: 1.00000 atm
elementType: 16 8 8 8 8 7 6 6 6 6 6 6 6 6 1 1 1 1 1 1 1 1 1
symmnumber: 1
zpe: 427297.6 jmol-1
zpe.correction: 0.162749 hartree
zpe.thermalcorrener: 0.177422 hartree
zpe.thermalcorrenthalpy: 0.178366 hartree
zpe.thermalcorrgfe: 0.119210 hartree
zpe.sumelectzpe: -1062.824687 hartree
zpe.sumelectthermal: -1062.810014 hartree
zpe.sumelectthermalent: -1062.809069 hartree
zpe.sumelectthermalfe: -1062.868225 hartree
dipole: -2.0728 -1.6164 -0.0001
dipole: 2.6285
quadrupole: -80.4380 -100.1431 -87.0056
quadrupole: -21.3968 -0.0008 0.0001
quadrupole: 8.7576 -10.9476 2.1900 -21.3968 -0.0008 0.0001
hfenergy: -1062.9874356 hartree
pointgroup: C01 [X(C8H9N1O4S1)]
dipole: -0.8560346 0.5802299 -0.0000897 debye
dipolederiv: -0.1170421 0.1413489 -0.000046 0.0924705 -0.0615034 0.0000414 -0.000038 0.0000598 0.1604825 -1.5020067 -0.513874 0.0000502 -0.9046178 -0.9050883 0.0000918 0.000125 0.0001028 -0.2736571 -0.8804372 0.2360845 -0.0000709 0.0469291 -0.8429173 0.0001061 -0.0000376 0.0001274 -0.3162594 -0.4610968 -0.0488287 0.0000315 0.0413044 -0.9113251 0.0001824 0.0000027 0.0001404 -0.2353863 -0.9375855 0.0588151 0.0000042 0.0189456 -0.46672 0.0000568 0.0000444 0.0000562 -0.2241042 1.4087488 -0.3320199 0.0000136 -0.3800476 1.5240124 -0.0003302 0.0000189 -0.0003054 0.2098148 0.3617262 0.0284863 0.0000252 -0.0706809 0.6010845 -0.0001459 0.0000077 -0.0001954 -0.0882423 -0.4964554 0.1938545 -0.0000496 0.1351603 -0.7323465 0.0001634 -0.0000398 0.0001661 0.0419271 -0.8619152 0.2056618 -0.0000716 0.546008 0.0688956 -0.0000173 -0.0001436 -0.0000364 -0.157113 0.3758896 -0.0979757 0.0000381 -0.1727344 -0.1653322 0.0000077 0.0000494 0.0000349 -0.0559676 -0.2806597 -0.2150425 0.000018 0.0235149 0.0899347 0.0000209 0.0000538 0.0000872 0.0235176 2.1586627 0.0358525 0.0000738 0.5339382 1.3137743 -0.0001909 -0.0000164 -0.0002185 0.2711349 1.0321854 0.3119922 -0.000032 0.220831 0.3326296 0.0000139 -0.0000151 0.0000149 0.352466 -0.062652 -0.0952552 0.0000159 -0.0695396 -0.082139 0.0000308 0.0000088 0.0000292 0.0574076 0.163443 0.0170014 -0.0000064 -0.0602318 0.0959941 0.0000154 0.0000124 0.0000179 0.1902994 0.0493932 -0.0014324 -0.0564576 -0.0060037 0.0601993 0.0591877 -0.0572345 0.0332847 0.0137793 0.0493769 -0.0014513 0.0564588 -0.0060337 0.0601905 -0.0591572 0.0572256 -0.0332855 0.0137256 0.0988637 0.0830869 0.000006 -0.0313479 -0.1034555 -0.000025 -0.0000132 -0.0000291 0.1226946 -0.0724752 -0.0520843 0.0161093 0.0252151 0.0015188 -0.090665 0.0531237 -0.0813844 -0.0540219 -0.0724743 -0.0521015 -0.0160893 0.025177 0.0015989 0.0906423 -0.0531389 0.0813559 -0.054116 -0.1735563 -0.0323749 -0.0000095 -0.0228326 0.0712531 0.0000103 -0.0000121 0.0000096 0.1191305 0.1100253 0.0651527 0.0771173 0.0073058 0.0248308 -0.0730961 0.0561436 -0.0917329 -0.0587071 0.1100416 0.0651039 -0.077129 0.0072702 0.0249108 0.0730566 -0.0561268 0.0917006 -0.0588049 unknown
polarizability: 193.1021676|1.7793127|145.5016865|0.0035238|-0.0170865|62.1432052 unknown
InChI: InChI=1S/C8H9NO4S/c1-3-13-8(10)7-4-6(9(11)12)5(2)14-7/h4H,3H2,1-2H3
charge 0 multiplicity 1
23 atoms
S  0.485924 2.126597 -0.000859
O  -2.630541 -0.463009 -0.000479
O  -2.606319 1.880712 -0.000967
O  2.196176 -2.516234 0.000166
O  3.892137 -0.984323 -0.00028
N  2.635222 -1.300008 -0.000103
C  1.983237 1.138822 -0.000568
C  1.646844 -0.224083 -0.00033
C  -0.536636 0.629321 -0.000601
C  0.239877 -0.515666 -0.000338
C  3.318975 1.818812 -0.000623
C  -1.999316 0.779068 -0.000696
C  -4.128991 -0.430762 -0.000567
C  -4.597433 -1.881039 -0.00024
H  -0.16879 -1.525806 -0.000157
H  3.910912 1.51307 0.880407
H  3.910748 1.513257 -0.881835
H  3.213766 2.916273 -0.000516
H  -4.460401 0.125589 0.894734
H  -4.460304 0.125154 -0.896175
H  -5.702175 -1.91352 -0.000298
H  -4.234801 -2.414183 -0.895223
H  -4.234909 -2.413743 0.895049
