program: Gaussian 09
title: 000292147
version: EM64L-G09RevD.01
frameworkgroup: C1[X(C7H6ClN3)]
method: RPBEPBE
basis: SDD
operation: Freq
keyword: #p
keyword: freq=noraman
keyword: PBEPBE/SDD
title: #p freq=noraman PBEPBE/SDD
converged: NO NO NO NO
title: Mulliken charges:
elementType: Cl N N N C C C C C C C H H H H H H
charge: 0.025424 0.004303 0.100028 0.008130 0.101578 0.135142 -0.764710 -0.758497 0.222050 -0.377335 -0.170990 0.266555 0.234051 0.234136 0.237194 0.237284 0.265658
chargesum: 0.00000
title: Mulliken charges with hydrogens summed into heavy atoms:
elementType: Cl N N N C C C C C C C
charge: 0.025424 0.004303 0.100028 0.008130 0.101578 0.135142 -0.029969 -0.018361 0.222050 -0.377335 -0.170990
polarizability: 1.62896726e+02 -8.11283653e+00 1.08027611e+02 -2.04296261e-03 -1.17544858e-03 4.91335549e+01
1716.lowfreq: -0.0032 -0.0010 -0.0006 10.2353 12.6382 13.5917 54.0939 78.8742 128.1649
frequency: 54.0419 78.6335 128.1574 130.0585 161.4675 222.8318 224.0235 282.8421 325.4381 351.4449 413.9409 445.3339 448.4719 512.8094 583.5136 613.5678 648.2164 655.5544 758.8903 777.4181 967.4562 985.7919 1014.5409 1023.9221 1056.5638 1153.4991 1237.1757 1258.4077 1335.3932 1376.7880 1401.2646 1405.0866 1439.0328 1455.3594 1458.5154 1471.7395 1485.6050 1520.5685 2186.5128 2984.6317 2986.3607 3057.8930 3061.3617 3126.1175 3127.8786
redmass: 3.9830 1.0787 2.2793 13.6103 1.4205 5.4431 6.2473 2.5071 4.7630 13.6626 4.5282 6.8297 6.5307 9.4753 4.9670 7.6918 4.2252 12.2215 4.7367 7.9197 2.0621 2.2493 3.4773 1.4191 1.6850 3.2875 9.9689 6.9038 5.6181 3.6178 1.5725 1.2479 1.4042 1.3962 1.0464 1.0444 2.4089 4.9729 12.6360 1.0386 1.0395 1.0965 1.0966 1.0983 1.0982
irintensity: 0.2078 0.0728 0.7500 1.0480 0.7992 1.4906 0.1003 0.6528 4.3876 11.4698 0.9532 5.5083 3.4026 2.4615 0.6604 6.2751 0.6715 0.6662 6.8079 1.4436 92.8680 8.0017 23.7527 7.9788 0.0001 12.2064 24.5481 24.4754 93.7400 93.6221 21.5175 56.5883 22.5573 3.3746 0.7509 41.8174 10.6918 39.6603 2.1389 16.8134 1.4214 23.4122 1.0510 7.1396 4.5459
temp: 298.150 k
press: 1.00000 atm
elementType: 17 7 7 7 6 6 6 6 6 6 6 1 1 1 1 1 1
symmnumber: 1
zpe: 307405.1 jmol-1
zpe.correction: 0.117084 hartree
zpe.thermalcorrener: 0.127847 hartree
zpe.thermalcorrenthalpy: 0.128791 hartree
zpe.thermalcorrgfe: 0.079904 hartree
zpe.sumelectzpe: -893.849136 hartree
zpe.sumelectthermal: -893.838374 hartree
zpe.sumelectthermalent: -893.837430 hartree
zpe.sumelectthermalfe: -893.886316 hartree
dipole: 6.3469 -1.4310 -0.0002
dipole: 6.5062
quadrupole: -68.4666 -80.0843 -69.3041
quadrupole: 6.0723 0.0016 -0.0016
quadrupole: 4.1518 -7.4660 3.3142 6.0723 0.0016 -0.0016
hfenergy: -893.9662207 hartree
pointgroup: C01 [X(C7H6Cl1N3)]
dipole: 2.5566761 0.1254752 -0.0000151 debye
dipolederiv: -0.4818397 -0.4269266 0.0000925 -0.4884883 -0.5602216 0.0001198 0.0000941 0.000099 -0.0379647 -0.0288282 -0.085517 0.0000718 0.0422645 -0.3225796 -0.0000076 -0.0000146 0.0000657 -0.2298426 -0.751165 -0.2454961 -0.0000185 0.0512417 -0.2531772 -0.0000082 -0.0000691 -0.0000093 -0.1865965 -0.2082359 0.064239 -0.0001639 0.0064858 -0.2027375 0.0000404 -0.0000766 0.0000114 -0.2134671 -0.0054209 0.3427644 -0.0001922 0.7928782 0.2486475 -0.0000579 -0.0004903 -0.0001834 0.0620244 0.774534 -0.079991 0.0001737 -0.5845356 0.0493179 -0.0000079 0.0005699 -0.000059 0.0804219 -0.1778488 -0.1842444 0.0001199 -0.1492363 -0.0814127 0.0000468 0.000284 0.0002669 0.040946 -0.392555 0.0914432 -0.0001455 0.0077919 0.0365733 -0.000017 -0.0005535 0.0001558 0.0235441 0.1866427 -0.0676011 -0.0000062 -0.5373123 0.0278421 0.0000625 0.000184 0.0000481 0.2455116 0.8116223 0.7070348 -0.0000921 0.776092 0.8593877 -0.0001719 -0.0002093 -0.0001443 0.0373464 -0.008709 -0.1396576 0.0001636 0.0311836 0.0120105 -0.0000417 0.0001133 -0.0000443 0.0185114 0.0768072 0.1173334 0.000057 0.0131477 -0.0330439 -0.0000757 -0.0000041 -0.000119 0.1264535 0.0198933 -0.0271625 -0.0935025 -0.0085772 0.0705051 0.0550884 -0.1124248 0.0045424 -0.0266949 0.0201231 -0.0272571 0.0934217 -0.0087067 0.0705339 -0.054997 0.1122875 -0.0045531 -0.0269266 0.0298642 -0.0033353 0.0541707 -0.0045272 0.0714194 0.0921707 0.0914211 0.0590834 -0.0199144 0.0299422 -0.0031782 -0.0541394 -0.0043663 0.0716222 -0.0920321 -0.0912137 -0.059033 -0.0201602 0.1051734 -0.0324478 -0.0000107 0.0646645 -0.0646872 -0.0001117 0.0001021 -0.0001274 0.1268079 unknown
polarizability: 163.1526753|7.1908898|107.7716551|0.0012211|-0.0195254|49.1335615 unknown
InChI: InChI=1S/C7H6ClN3/c1-4-5(2)11-7(8)6(3-9)10-4/h1-2H3
charge 0 multiplicity 1
17 atoms
Cl -1.848078 -2.379014 0.000555
N  -0.020539 1.277932 -0.000448
N  0.693033 -1.446633 0.000516
N  -3.5045 1.065784 -0.000161
C  1.291515 0.907322 -0.000265
C  1.661674 -0.482583 0.000273
C  2.322381 2.008752 -0.000658
C  3.098548 -0.93491 0.00063
C  -0.982405 0.299362 -0.000161
C  -0.592838 -1.068529 0.000305
C  -2.36297 0.710435 -0.000409
H  1.815064 2.984657 -0.000144
H  2.979138 1.946282 0.887326
H  2.977935 1.946693 -0.889573
H  3.638536 -0.553493 -0.886481
H  3.63767 -0.554595 0.888758
H  3.139635 -2.033963 0.000036
