program: Gaussian 09
title: 000292322
version: EM64L-G09RevD.01
frameworkgroup: C1[X(C21H27NO6S)]
method: RPBEPBE
basis: SDD
operation: Freq
keyword: #p
keyword: freq=noraman
keyword: PBEPBE/SDD
title: #p freq=noraman PBEPBE/SDD
converged: NO YES NO NO
title: Mulliken charges:
elementType: S O O O O O O N C C C C C C C C C C C C C C C C C C C C C H H H H H H H H H H H H H H H H H H H H H H H H H H H
charge: 0.996390 -0.271424 -0.560360 -0.485422 -0.487563 -0.204967 -0.195229 0.022030 0.152114 0.143204 0.413193 0.415017 -0.166331 -0.613412 -0.569143 -0.755588 -0.738125 -0.727473 -0.754245 -0.731143 -0.731560 0.443700 -0.825703 0.491550 -0.305004 -0.231621 -0.398197 -0.390578 0.413402 0.269086 0.268170 0.221764 0.215454 0.226777 0.260159 0.220288 0.214568 0.264511 0.214926 0.205022 0.228008 0.222902 0.212722 0.210330 0.206310 0.292045 0.223625 0.216391 0.237832 0.226687 0.227896 0.238159 0.301198 0.345903 0.294364 0.387391
chargesum: 0.00000
title: Mulliken charges with hydrogens summed into heavy atoms:
elementType: S O O O O O O N C C C C C C C C C C C C C C C C C C C C C
charge: 0.996390 -0.271424 -0.172968 -0.485422 -0.487563 -0.204967 -0.195229 0.022030 0.152114 0.143204 0.413193 0.415017 -0.166331 -0.344326 -0.300974 -0.091593 -0.043111 -0.043014 -0.090614 -0.022456 -0.053713 0.443700 -0.132961 0.491550 -0.305004 0.069577 -0.052294 -0.096215 0.413402
polarizability: 3.65800883e+02 -1.07301153e+00 2.56151561e+02 -1.01561638e+00 7.40048862e+00 2.68482328e+02
1716.lowfreq: -51.2224 -7.3119 -0.0007 0.0011 0.0016 2.7975 10.9648 26.3659 34.4425
frequency: -51.1991 26.3331 34.4266 40.6832 43.8777 54.5538 55.7452 61.7820 72.4688 95.9563 107.5967 116.5812 134.1242 143.2249 146.6687 155.7893 174.6310 202.2476 205.3885 215.5871 216.7629 226.1012 243.1016 246.6475 247.2885 261.9687 278.7219 284.7647 292.9990 300.5238 310.9006 313.6924 327.0504 335.0759 343.4943 347.1083 352.1945 381.4301 391.2101 396.0641 402.8807 415.3828 420.2818 432.6002 461.4387 463.3754 510.6016 518.5648 521.9616 549.1496 555.1467 564.8716 589.6917 598.5512 631.7128 638.1165 657.7090 688.7849 719.1510 731.9072 747.6656 781.6119 790.8089 805.9011 836.0925 843.0895 856.4647 880.8204 882.1778 909.7046 923.2891 925.2161 927.8413 932.5304 943.7778 948.5127 953.7395 956.2946 960.7806 997.0940 1004.9674 1007.9384 1023.4351 1026.2206 1028.6594 1031.8309 1048.1470 1050.8359 1074.7850 1099.3635 1131.8743 1166.7567 1195.5004 1201.2217 1203.2331 1206.5355 1208.6882 1222.8593 1225.9531 1236.8231 1244.3092 1264.8936 1294.0107 1339.7480 1352.7995 1375.8483 1377.7646 1381.4675 1382.1844 1389.9492 1399.0132 1405.5555 1407.4954 1414.6472 1417.9603 1428.3970 1452.5303 1459.5885 1460.7879 1468.2847 1471.1778 1471.9654 1472.6293 1476.1266 1477.8607 1484.3037 1486.8359 1494.1787 1495.7570 1503.2657 1505.9064 1571.7389 1583.1874 1597.8879 1606.9608 2973.7341 2974.1470 2977.0062 2978.9397 2980.1401 2985.6889 2985.9742 3057.3519 3065.3423 3067.0477 3067.4017 3068.6976 3070.5359 3071.0009 3079.4105 3080.3837 3086.1222 3106.2161 3109.0670 3111.6281 3122.1180 3160.1000 3167.6632 3169.7276 3170.6416 3187.3054 3480.6737
redmass: 1.0124 6.1079 4.3008 7.4826 4.6156 5.1414 3.4020 4.8230 4.3114 7.0629 7.5907 5.3164 4.2288 2.6801 3.4520 1.8837 3.2346 2.6239 3.2139 1.5041 3.1101 1.4354 2.1871 2.0988 1.1742 2.1934 2.5924 3.8394 3.1469 4.3234 2.4767 2.7141 6.7147 2.7708 1.3992 2.1210 2.1342 2.5498 2.5956 2.2094 4.0797 2.7831 4.2735 4.1369 4.2925 5.0276 6.9066 3.4541 4.0493 2.7802 8.7915 4.0083 4.3375 4.3484 6.1246 4.6375 7.2286 6.5738 7.3638 4.5113 4.9314 5.3414 8.1660 3.3189 9.3847 1.5146 7.2671 1.6995 1.9334 1.4450 1.7280 1.6773 1.7589 1.7142 2.8006 1.3161 1.2313 1.4666 7.0327 1.3549 1.4170 3.2269 1.3962 1.3827 1.3776 1.3874 1.5810 1.1848 5.2877 2.9555 1.2792 2.4520 2.3380 2.8468 2.8816 2.8546 5.4531 2.1690 2.7293 2.3890 1.8096 1.7663 5.0761 10.2174 5.6340 1.2016 1.2120 1.1858 1.1934 8.3616 1.2376 1.3434 1.3911 1.9763 2.1596 6.3004 2.4951 1.0497 1.0605 1.0593 1.0619 1.1042 1.0551 1.0682 1.1136 1.0610 1.0599 1.0516 1.0531 1.0568 1.0632 8.6960 7.1681 5.4131 6.8380 1.0359 1.0356 1.0384 1.0368 1.0366 1.0381 1.0380 1.0957 1.0998 1.0998 1.0995 1.0993 1.0997 1.0996 1.0986 1.0984 1.0994 1.0988 1.0981 1.0966 1.0961 1.0922 1.0893 1.0888 1.0902 1.0968 1.0662
irintensity: 0.3898 0.1862 0.1172 0.4639 0.6946 0.1070 0.1292 0.3583 0.1085 0.5110 1.2875 1.8956 1.2849 0.4407 17.6901 52.1750 2.6634 22.3648 5.8925 1.5859 3.5809 3.2184 3.1481 4.4985 0.4377 0.1950 3.6092 10.4414 8.7933 17.2847 2.7187 1.4777 10.5580 0.5843 0.5636 0.7411 0.5261 6.3056 0.1560 0.3817 17.8237 0.2301 34.0548 25.9607 3.4324 4.2982 3.4118 17.6313 22.0711 4.8005 85.4019 2.1727 6.4478 0.0305 6.8438 1.2006 4.6900 2.9529 16.6612 18.0226 0.0065 3.0509 3.4333 2.1756 61.1105 46.0846 43.3083 18.5860 18.2866 0.0650 4.0318 3.6432 6.0496 4.8217 2.6907 0.6733 0.6899 28.9535 78.3726 0.8197 2.8161 7.5584 0.6118 0.6267 1.5379 0.3671 5.9833 68.1991 179.7505 20.6147 50.9782 41.5823 0.5460 10.8445 0.8301 0.8112 461.8038 120.9449 62.4521 168.2708 8.2845 33.6819 0.8247 10.4071 33.9876 6.9017 7.4580 6.2002 30.1027 79.4346 18.6409 18.3981 19.4144 8.6891 89.7541 3.4008 74.3284 0.2885 3.0641 0.9708 15.0676 8.0844 6.9978 3.5049 14.6204 6.5625 7.5744 9.0893 18.3135 22.0279 10.1713 17.1290 3.6781 38.8156 198.4155 20.6355 24.8456 36.2252 30.7252 51.1153 39.0008 9.3813 15.9369 8.9831 5.9714 13.7133 9.5863 33.2376 54.6810 79.4945 60.0454 15.1816 3.7595 13.7618 32.5317 21.1129 27.0090 5.0946 0.3731 10.8208 2.5310 50.0430
temp: 298.150 k
press: 1.00000 atm
elementType: 16 8 8 8 8 8 8 7 6 6 6 6 6 6 6 6 6 6 6 6 6 6 6 6 6 6 6 6 6 1 1 1 1 1 1 1 1 1 1 1 1 1 1 1 1 1 1 1 1 1 1 1 1 1 1 1
symmnumber: 1
zpe: 1155752.7 jmol-1
zpe.correction: 0.440203 hartree
zpe.thermalcorrener: 0.470937 hartree
zpe.thermalcorrenthalpy: 0.471881 hartree
zpe.thermalcorrgfe: 0.379601 hartree
zpe.sumelectzpe: -1718.131387 hartree
zpe.sumelectthermal: -1718.100653 hartree
zpe.sumelectthermalent: -1718.099709 hartree
zpe.sumelectthermalfe: -1718.191989 hartree
dipole: -8.1474 0.7567 -1.3784
dipole: 8.2978
quadrupole: -205.3750 -168.9026 -193.4634
quadrupole: 7.1540 11.3377 -0.7119
quadrupole: -16.1280 20.3444 -4.2164 7.1540 11.3377 -0.7119
hfenergy: -1718.5715903 hartree
pointgroup: C01 [X(C21H27N1O6S1)]
dipole: -3.2151285 -0.3772396 0.4221279 debye
polarizability: 365.6878249|1.1396458|254.4205374|3.38123|5.5381743|270.3264095 unknown
InChI: InChI=1S/C21H27NO6S/c1-13-10-15(20(2,3)4)19(16(11-13)21(5,6)7)28-17-9-8-14(22(23)24)12-18(17)29(25,26)27/h8-12,25H,1-7H3
charge 0 multiplicity 1
56 atoms
S  2.429555 -0.52607 -2.221143
O  -0.211393 -0.190281 -0.659614
O  1.924125 -2.301854 -2.031124
O  1.407092 0.211888 -3.229145
O  4.016104 -0.457284 -2.52038
O  4.285854 0.991754 3.732247
O  5.582513 0.538247 1.906538
N  4.438455 0.675044 2.488175
C  -1.642319 -2.637845 0.273498
C  -1.598748 2.442039 -1.040774
C  -2.185041 -1.186125 0.43692
C  -2.162072 1.257551 -0.197348
C  -1.547177 -0.027874 -0.099286
C  -3.439162 -0.962118 1.063381
C  -3.415191 1.386643 0.454651
C  -2.633775 -3.681376 0.862214
C  -0.272019 -2.866675 0.982481
C  -1.497874 -2.939787 -1.25129
C  -2.589535 3.64132 -1.060844
C  -1.416225 1.96777 -2.516413
C  -0.245675 2.993782 -0.496025
C  -4.048627 0.309983 1.114533
C  -5.388122 0.505378 1.804002
C  0.879718 0.035998 0.154316
C  2.177493 -0.087729 -0.409797
C  0.79043 0.386807 1.530859
C  3.350842 0.108663 0.323928
C  1.949516 0.594993 2.288987
C  3.219528 0.456972 1.682566
H  -3.964424 -1.805071 1.518461
H  -3.924329 2.353258 0.44037
H  -3.632809 -3.619976 0.393761
H  -2.748218 -3.579208 1.957803
H  -2.237514 -4.693347 0.66395
H  0.566217 -2.422493 0.426095
H  -0.072751 -3.952774 1.041953
H  -0.277031 -2.469596 2.014185
H  -0.781845 -2.254873 -1.732393
H  -2.474923 -2.850262 -1.761282
H  -1.129402 -3.973708 -1.389978
H  -2.179585 4.422391 -1.725723
H  -3.58065 3.356812 -1.458275
H  -2.723808 4.094701 -0.060644
H  -2.381679 1.631936 -2.938257
H  -1.048704 2.810707 -3.131462
H  -0.687349 1.146916 -2.605122
H  -0.023951 3.95812 -0.989398
H  -0.287896 3.17409 0.593944
H  0.601228 2.325358 -0.712102
H  -5.599616 -0.310097 2.516832
H  -5.422322 1.460206 2.358607
H  -6.21647 0.525905 1.069561
H  -0.198504 0.489042 1.984052
H  4.337148 0.000972 -0.139774
H  1.894366 0.864303 3.347006
H  1.880154 -2.704526 -2.946986
