program: Gaussian 09
title: 000292219
version: EM64L-G09RevD.01
frameworkgroup: C1[X(C20H28N2O2)]
method: RPBEPBE
basis: SDD
operation: Freq
keyword: #p
keyword: freq=noraman
keyword: PBEPBE/SDD
title: #p freq=noraman PBEPBE/SDD
converged: YES YES NO NO
title: Mulliken charges:
elementType: O O N N C C C C C C C C C C C C C C C C C C C C H H H H H H H H H H H H H H H H H H H H H H H H H H H H
charge: -0.324421 -0.316170 -0.087034 -0.104770 0.299959 -0.067675 -0.522198 -0.484410 -0.520299 0.060465 -0.522085 -0.414631 -0.403304 -0.591857 0.372773 -0.430128 0.085419 -0.435647 0.200991 -0.375707 -0.594477 -0.514800 -0.104369 -0.548681 0.215771 0.207046 0.260728 0.198209 0.194693 0.227242 0.199091 0.217444 0.273312 0.199720 0.196436 0.198506 0.206439 0.226125 0.217461 0.223639 0.268116 0.233170 0.236992 0.237562 0.242058 0.231611 0.256083 0.207675 0.251967 0.275496 0.225945 0.214517
chargesum: 0.00000
title: Mulliken charges with hydrogens summed into heavy atoms:
elementType: O O N N C C C C C C C C C C C C C C C C C C C C
charge: -0.324421 -0.316170 -0.087034 -0.104770 0.299959 0.148096 -0.054423 -0.091508 -0.093966 0.060465 -0.031329 -0.018475 0.001642 -0.148271 0.372773 0.061628 0.085419 -0.202477 0.200991 -0.138715 0.116754 0.200926 -0.104369 0.167278
polarizability: 2.77922427e+02 9.81928590e+00 2.13060844e+02 -9.85854887e+00 2.51812332e+01 1.88561867e+02
1716.lowfreq: -11.7056 -8.8290 -7.4305 -0.0004 -0.0004 0.0005 27.5950 44.2313 47.9426
frequency: 27.3819 44.2159 47.9093 63.4539 71.7694 87.0321 89.9874 114.5862 121.1371 129.6301 143.4252 145.4120 160.9052 166.4924 197.1844 208.1037 229.7180 243.0754 254.4482 276.1317 291.3515 302.7271 320.9224 329.8739 340.5272 357.1739 367.5878 382.2132 393.0356 411.8344 434.7856 469.0409 481.7692 487.6505 497.0717 544.3768 565.8504 574.7154 611.1684 621.8227 638.2037 659.7902 710.2462 716.6555 750.5815 762.7818 790.3394 797.5264 812.1492 828.4803 858.0986 868.7133 874.4036 884.3140 924.3494 931.6220 946.7258 973.6881 979.7747 992.5428 1001.3298 1018.4464 1044.1044 1048.3686 1057.3857 1065.0469 1080.8614 1089.1482 1110.6470 1116.6022 1118.7795 1119.8359 1128.9222 1140.2019 1148.8671 1153.3641 1161.6880 1171.2618 1180.8617 1188.6525 1195.1568 1215.2718 1222.0801 1237.9964 1247.7942 1259.7230 1261.5528 1287.7591 1293.9326 1300.0468 1317.5452 1328.6568 1334.8439 1337.0054 1343.2385 1346.8531 1350.7665 1359.5355 1361.2813 1367.6084 1386.9294 1434.1134 1435.6524 1444.9375 1453.0738 1455.5238 1457.6274 1462.8742 1465.7549 1466.2627 1468.0592 1472.7639 1473.2963 1476.0631 1478.9060 1485.4836 1488.2085 1490.2677 1491.1725 1570.5455 1595.5293 2171.1695 2936.0424 2948.7944 2958.8558 2963.9187 2966.6615 2968.5931 2973.2761 2982.7507 2986.0930 2991.8320 2993.4437 3010.7071 3014.6247 3016.6374 3023.1566 3036.8413 3045.7151 3053.7285 3053.8203 3058.7742 3072.4604 3085.3208 3100.0028 3106.4015 3112.9583 3121.2278 3128.4458 3151.9459
redmass: 4.9247 4.0929 4.4885 4.8117 4.1128 3.7822 3.3894 2.9544 3.1509 1.1540 2.6629 3.1834 2.1003 1.3953 3.7610 3.0976 2.7862 2.4784 1.5040 4.3222 2.2968 2.6684 3.4294 2.9027 2.8453 2.6425 3.3896 3.4189 2.4215 3.2542 3.4772 3.3661 2.7231 4.6118 6.6748 2.7655 3.3295 3.9299 5.3015 4.6256 2.9934 3.1556 4.0022 4.0426 3.5697 3.7330 1.6800 1.7975 1.6095 2.3484 2.6188 2.2680 2.7553 1.8200 2.7588 1.4379 2.2986 3.1017 2.9728 2.1093 1.9868 2.7251 2.2039 2.0600 2.3178 2.2477 2.2431 1.7260 1.3311 1.2354 1.4845 1.8841 1.4666 1.7581 1.3909 1.4849 1.7183 1.5315 1.8515 1.7357 3.0818 1.5491 1.8615 1.7539 2.7196 1.3180 1.3431 1.2917 1.3583 1.3036 1.5693 1.5516 1.4045 1.5057 1.6303 3.7552 1.6182 1.4194 1.8023 1.4572 2.7796 1.2413 1.1455 1.2299 1.3053 1.0563 1.1222 1.1115 1.0937 1.1088 1.0790 1.0853 1.4059 1.1376 1.0538 1.0849 1.1014 1.0554 1.0651 7.0435 6.9919 12.3718 1.0794 1.0655 1.0311 1.0391 1.0614 1.0616 1.0667 1.0659 1.0632 1.0616 1.0295 1.0743 1.0871 1.0935 1.0963 1.1016 1.1007 1.1028 1.0982 1.0996 1.0945 1.1005 1.1048 1.1008 1.1012 1.0876 1.1045 1.0964
irintensity: 2.4576 2.7369 1.7348 0.4710 1.7665 1.4335 7.2168 13.3994 2.6531 0.0969 2.8251 1.3329 0.9967 1.8213 4.4855 1.1349 3.6668 0.6124 2.3321 2.7398 6.5633 4.5517 2.6473 2.4624 1.6529 1.0112 2.0543 0.1708 0.3495 0.2823 4.4495 0.4619 1.7704 0.4531 7.1001 0.4548 1.9739 10.2072 8.3632 2.5548 9.5974 3.1799 1.2135 1.9399 11.0783 0.5715 13.6541 3.1026 44.1557 7.8805 0.2727 4.6796 1.1683 3.0602 14.4049 1.8813 5.0746 36.3724 67.1684 18.3152 2.8759 2.3753 23.5464 45.2915 7.2030 7.5571 18.1979 5.8587 5.0493 0.7019 1.8825 3.4776 2.1508 3.1721 2.2383 1.0456 7.7426 1.9643 5.8309 16.7047 13.3275 11.5086 19.4137 44.5551 69.8357 12.3819 0.9003 7.0272 5.9939 2.3772 5.4538 9.5652 0.1669 5.8425 8.2612 13.4748 12.1156 5.0907 15.5297 5.9042 40.5669 2.6716 11.0406 15.2171 48.6327 9.8069 8.8824 20.8142 9.2372 8.1404 23.6120 3.8309 32.6642 10.9355 16.9012 15.9388 21.1830 7.5756 11.6948 8.6052 2.5365 185.7423 22.5017 32.7048 66.8524 51.1484 49.3169 35.3571 18.5597 25.8302 46.1279 30.3467 62.1639 66.8610 19.5816 58.6542 64.4859 86.2279 65.2409 14.5932 36.1184 9.0654 16.8244 12.1763 22.2175 14.9859 31.1883 11.9110 15.3110 17.8832
temp: 298.150 k
press: 1.00000 atm
elementType: 8 8 7 7 6 6 6 6 6 6 6 6 6 6 6 6 6 6 6 6 6 6 6 6 1 1 1 1 1 1 1 1 1 1 1 1 1 1 1 1 1 1 1 1 1 1 1 1 1 1 1 1
symmnumber: 1
zpe: 1162822.6 jmol-1
zpe.correction: 0.442896 hartree
zpe.thermalcorrener: 0.467119 hartree
zpe.thermalcorrenthalpy: 0.468063 hartree
zpe.thermalcorrgfe: 0.389932 hartree
zpe.sumelectzpe: -1036.986532 hartree
zpe.sumelectthermal: -1036.962309 hartree
zpe.sumelectthermalent: -1036.961365 hartree
zpe.sumelectthermalfe: -1037.039495 hartree
dipole: 3.1097 1.8975 -1.1584
dipole: 3.8226
quadrupole: -145.8049 -134.5270 -143.1176
quadrupole: 6.5887 -3.6118 5.0936
quadrupole: -4.6550 6.6228 -1.9678 6.5887 -3.6118 5.0936
hfenergy: -1037.4294277 hartree
pointgroup: C01 [X(C20H28N2O2)]
dipole: -1.3656249 0.5174309 0.3594197 debye
polarizability: 279.1617308|5.0520031|204.2631622|-2.9752754|-28.8112149|196.1202449 unknown
InChI: InChI=1S/C20H28N2O2/c1-22(14-21)13-12-20-11-5-4-6-16(20)9-7-15-8-10-17(23-2)19(24-3)18(15)20/h8,10,16H,4-7,9,11-13H2,1-3H3
charge 0 multiplicity 1
52 atoms
O  1.02529 0.053988 -1.7862
O  3.681461 -0.778769 -0.85033
N  -0.101316 3.067664 0.724179
N  2.408892 2.966486 0.306279
C  -1.365577 -0.466939 -0.318796
C  -2.483994 -0.841592 0.729087
C  -1.756548 -1.047636 -1.726583
C  -3.911259 -0.488173 0.227872
C  -2.369607 -2.315459 1.173605
C  0.018177 -1.053937 0.100422
C  -1.273322 1.10212 -0.391429
C  -3.186312 -0.687995 -2.193047
C  -4.241831 -1.110298 -1.147477
C  -1.066034 -2.483504 1.965431
C  0.143937 -1.949911 1.203232
C  -0.811091 1.769596 0.931851
C  1.219922 -0.692394 -0.614645
C  1.420062 -2.403591 1.622132
C  2.49564 -1.128191 -0.150675
C  2.585533 -1.979751 0.96996
C  -0.895554 4.254642 0.342978
C  2.108339 0.767804 -2.496042
C  1.219219 3.036989 0.484595
C  4.592568 0.118586 -0.102793
H  -2.304937 -0.239942 1.647156
H  -1.668349 -2.15151 -1.68036
H  -1.011578 -0.707106 -2.465022
H  -4.028954 0.61236 0.155813
H  -4.643943 -0.826791 0.987781
H  -2.3742 -2.995812 0.301082
H  -3.238525 -2.588754 1.803788
H  -2.253217 1.512511 -0.695114
H  -0.54877 1.359927 -1.180449
H  -3.385425 -1.184929 -3.162845
H  -3.268385 0.402121 -2.379903
H  -5.255398 -0.801546 -1.469811
H  -4.257058 -2.215909 -1.066234
H  -0.888438 -3.547178 2.215533
H  -1.162159 -1.951248 2.93588
H  -1.661642 1.97848 1.608265
H  -0.115172 1.099609 1.467466
H  1.487225 -3.102118 2.464431
H  3.573544 -2.333464 1.284188
H  -1.289332 4.179451 -0.690239
H  -0.27257 5.160275 0.419874
H  -1.74629 4.353853 1.040391
H  2.596997 1.501245 -1.832146
H  1.581143 1.291199 -3.311341
H  2.850472 0.062819 -2.897846
H  4.109802 1.096507 0.086374
H  5.475729 0.243689 -0.748513
H  4.89924 -0.338175 0.857894
