program: Gaussian 09
title: 000292142
version: EM64L-G09RevD.01
frameworkgroup: C1[X(C12H14ClNO3)]
method: RPBEPBE
basis: SDD
operation: Freq
keyword: #p
keyword: freq=noraman
keyword: PBEPBE/SDD
title: #p freq=noraman PBEPBE/SDD
converged: YES YES NO NO
title: Mulliken charges:
elementType: Cl O O O N C C C C C C C C C C C C H H H H H H H H H H H H H H
charge: -0.046105 -0.480325 -0.455564 -0.289018 -0.389708 -0.051419 -0.375567 -0.374082 0.237561 0.563586 -0.366410 -0.227936 -0.306911 -0.363773 -0.230681 -0.247902 -0.223208 0.193823 0.245943 0.241962 0.250818 0.211918 0.318039 0.363640 0.206314 0.286921 0.228375 0.349079 0.258576 0.233824 0.238229
chargesum: 0.00000
title: Mulliken charges with hydrogens summed into heavy atoms:
elementType: Cl O O O N C C C C C C C C C C C C
charge: -0.046105 -0.116686 -0.106485 -0.289018 -0.071668 0.142405 0.112338 0.088655 0.237561 0.563586 -0.160096 0.058984 -0.306911 -0.135397 0.027894 -0.014078 0.015021
polarizability: 2.68182525e+02 1.33036185e+01 1.67490033e+02 2.15193691e+01 -4.85448937e+00 8.85270684e+01
1716.lowfreq: -10.6484 0.0014 0.0019 0.0022 1.5105 3.2069 7.0765 22.6922 33.8244
frequency: 5.3782 22.0763 33.7722 53.9455 81.3921 85.9135 106.2689 137.3224 165.4344 192.7950 209.7041 221.6212 271.2110 282.2532 298.3722 324.1025 344.8031 373.7244 389.2342 444.8572 488.7889 518.7391 519.2740 574.5319 578.5655 595.1919 651.9663 662.3086 676.4236 728.9032 734.5299 764.0337 820.4839 835.8924 863.5671 876.6662 879.1888 949.4186 950.3686 957.1309 975.2498 985.4804 1014.9724 1016.9158 1036.3059 1041.7585 1089.5890 1102.4401 1120.3089 1142.2843 1171.8968 1191.2880 1215.5988 1227.2508 1260.0170 1283.8862 1292.6549 1312.6337 1321.1729 1325.7298 1343.5557 1355.5983 1375.7213 1397.9300 1427.5654 1451.6893 1459.1230 1461.3459 1483.2263 1565.6941 1580.7191 1601.6001 1651.9362 2935.8955 2995.4527 3003.8017 3070.9352 3104.2540 3104.6546 3128.0659 3136.2653 3148.9891 3163.5675 3178.0217 3474.6283 3544.5624 3566.7058
redmass: 7.3911 5.1779 6.2302 4.8250 4.2902 5.4370 3.6737 3.4814 4.6732 5.7174 5.5166 4.7061 5.8921 4.1058 4.2409 1.1166 2.4998 4.4310 10.2908 3.0190 2.9298 3.5594 4.0865 2.2351 1.6703 1.5205 3.1687 4.1277 3.7194 4.7362 2.9345 1.4576 3.3581 3.4661 1.4089 2.5212 2.1037 1.3905 2.3228 3.5579 4.0076 1.3428 1.1794 6.8667 1.7838 2.0308 2.9159 2.5320 1.7562 1.3440 1.0743 1.4846 1.4910 1.3204 1.1541 1.6874 1.7451 1.2505 1.3658 1.3102 1.3123 1.3662 5.5035 1.5878 2.3414 1.0819 1.4451 1.6287 2.0001 5.8275 7.7169 6.7642 5.6843 1.0836 1.0648 1.0646 1.0984 1.1011 1.0927 1.0874 1.0854 1.0902 1.0955 1.0995 1.0647 1.0773 1.0664
irintensity: 0.0449 1.4914 8.7436 3.4968 9.1392 3.4720 1.5869 1.5564 0.2701 3.0215 1.5472 6.9421 4.2953 11.8801 3.1408 102.7871 17.4241 5.8323 9.4788 13.8386 12.0222 1.7632 10.1369 109.3646 43.6573 116.6369 53.6546 31.4325 2.1473 21.6105 7.0422 89.6120 5.8405 7.7183 2.2670 9.1517 14.7327 0.6466 86.3446 18.1039 14.2405 1.0677 45.5357 51.5969 22.6707 6.5248 67.2517 20.9803 1.6668 71.1259 2.2610 26.9928 13.3420 139.5229 12.1693 12.6338 71.3752 30.0519 3.6630 9.1896 30.0447 5.7780 13.6715 24.0817 30.0363 3.2500 69.8981 12.4948 333.1497 2.6864 152.6575 1.5637 68.0783 81.2693 69.4027 30.2938 8.1773 23.3279 15.9361 3.0566 0.8940 7.0438 16.8287 14.6810 31.2890 54.3689 10.4352
temp: 298.150 k
press: 1.00000 atm
elementType: 17 8 8 8 7 6 6 6 6 6 6 6 6 6 6 6 6 1 1 1 1 1 1 1 1 1 1 1 1 1 1
symmnumber: 1
zpe: 631084.5 jmol-1
zpe.correction: 0.240367 hartree
zpe.thermalcorrener: 0.257720 hartree
zpe.thermalcorrenthalpy: 0.258664 hartree
zpe.thermalcorrgfe: 0.190808 hartree
zpe.sumelectzpe: -1204.879475 hartree
zpe.sumelectthermal: -1204.862123 hartree
zpe.sumelectthermalent: -1204.861178 hartree
zpe.sumelectthermalfe: -1204.929034 hartree
dipole: -1.7042 3.1346 0.4584
dipole: 3.5972
quadrupole: -70.9447 -108.6413 -113.1390
quadrupole: 15.7122 -2.6520 -3.0538
quadrupole: 26.6303 -11.0663 -15.5640 15.7122 -2.6520 -3.0538
hfenergy: -1205.1198425 hartree
pointgroup: C01 [X(C12H14Cl1N1O3)]
dipole: -0.4545074 -0.8696944 -1.0197918 debye
polarizability: 269.8568245|16.3048478|139.8648282|-12.1812974|37.5535905|114.4779734 unknown
InChI: InChI=1S/C12H14ClNO3/c13-11-4-2-1-3-9(11)5-6-12(17)14-7-10(16)8-15/h1-6,10,14-16H,7-8H2
charge 0 multiplicity 1
31 atoms
Cl 3.375136 2.673107 1.504921
O  -4.353432 -1.641184 -1.07727
O  -5.128502 0.586341 -2.511263
O  -1.398657 1.238844 1.546595
N  -2.240709 -0.636024 0.444098
C  -4.584776 -0.398667 -0.320399
C  -3.622112 -0.430182 0.879231
C  -4.369742 0.805555 -1.256401
C  -1.205677 0.217735 0.808334
C  2.61127 0.332249 0.105438
C  0.129855 -0.167131 0.26502
C  1.23432 0.582673 0.554084
C  3.683102 1.199615 0.465091
C  2.959846 -0.788785 -0.70941
C  5.012363 0.984559 0.054502
C  4.279851 -1.023574 -1.131835
C  5.314369 -0.135238 -0.750181
H  -5.629885 -0.386374 0.064258
H  -3.653805 0.516845 1.446787
H  -3.936255 -1.249545 1.55412
H  -3.316914 0.863995 -1.574178
H  -4.658093 1.755176 -0.765084
H  -2.081369 -1.422623 -0.189613
H  -4.698053 -1.473006 -1.997191
H  0.182261 -1.06753 -0.361886
H  1.064341 1.461021 1.190388
H  2.170989 -1.485766 -1.010846
H  -6.081468 0.814406 -2.365835
H  5.796235 1.682828 0.360971
H  4.506788 -1.894587 -1.755329
H  6.346122 -0.308732 -1.072817
