program: Gaussian 09
title: 000028059
version: EM64L-G09RevD.01
frameworkgroup: C1[X(C16H24Cl2N2O3)]
method: RPBEPBE
basis: SDD
operation: Freq
keyword: #p
keyword: freq=noraman
keyword: PBEPBE/SDD
title: #p freq=noraman PBEPBE/SDD
converged: YES YES NO NO
title: Mulliken charges:
elementType: Cl Cl O O O N N C C C C C C C C C C C C C C C C H H H H H H H H H H H H H H H H H H H H H H H H
charge: -0.019910 -0.040046 -0.306578 -0.260522 -0.245674 -0.091089 -0.467315 -0.381075 -0.385430 -0.311560 -0.242566 -0.684149 -0.695767 0.653438 0.281617 -0.260849 0.392711 -0.394746 -0.268949 -0.265045 -0.345156 -0.433555 -0.676228 0.221965 0.203579 0.220754 0.216071 0.186124 0.208709 0.234852 0.230757 0.223061 0.220263 0.216728 0.231003 0.213310 0.212599 0.206993 0.210509 0.220433 0.221719 0.333346 0.279295 0.282862 0.210982 0.212371 0.230159
chargesum: 0.00000
title: Mulliken charges with hydrogens summed into heavy atoms:
elementType: Cl Cl O O O N N C C C C C C C C C C C C C C C C
charge: -0.019910 -0.040046 -0.306578 -0.260522 -0.245674 -0.091089 -0.133969 0.044469 0.051395 0.083272 0.223043 -0.024097 -0.038855 0.653438 0.281617 0.156653 0.392711 0.047406 -0.268949 -0.265045 -0.065861 -0.150693 -0.022717
polarizability: 3.25477438e+02 6.04251460e+00 2.11508786e+02 -1.55271819e+01 5.28098038e+00 1.55114852e+02
1716.lowfreq: -30.8116 -7.4381 -4.6807 -1.3518 -0.0021 -0.0015 -0.0007 13.8768 18.0416
frequency: -29.0066 13.4747 18.0298 33.1263 41.9148 50.5251 55.9450 61.6601 75.0824 80.6728 89.4265 100.9973 125.2845 135.6329 142.9641 161.3649 175.3058 192.5428 203.0144 210.3107 212.0723 216.0695 230.8944 261.8790 275.9953 280.9465 285.3829 306.5163 343.8368 366.9124 369.2264 401.4868 431.6280 467.5691 487.1835 510.4470 511.2151 529.7850 561.7650 585.9377 604.9082 668.8734 703.9787 711.2665 746.2323 760.4229 769.9752 771.5724 789.8905 801.1328 816.6780 840.4575 859.8402 886.0261 895.2473 898.8587 910.0807 917.8777 973.5023 992.2657 996.0677 1038.4405 1051.4324 1053.7101 1063.8332 1067.7090 1085.6777 1091.6842 1113.8982 1136.7119 1142.7028 1157.8003 1168.0797 1185.4097 1204.0311 1214.4793 1232.6918 1232.8889 1270.0296 1287.6544 1288.9347 1292.4074 1312.7185 1317.5963 1333.5293 1340.7694 1347.1656 1368.0794 1375.5648 1380.4524 1383.8047 1386.3299 1398.1032 1407.4338 1455.1411 1457.1346 1466.2741 1470.4871 1472.9507 1476.0190 1479.0782 1480.0092 1481.4926 1482.0674 1487.4088 1489.2086 1495.5001 1495.6520 1551.7971 1614.5765 1677.1296 2859.4799 2908.8449 2953.4201 2975.8486 2980.8680 2984.4856 2991.4614 3006.3346 3013.5390 3017.1098 3021.2325 3037.4912 3042.7237 3055.5705 3072.3198 3076.0178 3079.4841 3083.3539 3086.6633 3090.4564 3092.8333 3187.1615 3188.4012 3542.6369
redmass: 3.1767 4.9089 4.8002 3.8957 3.1877 4.1343 3.6542 6.4672 4.2421 1.7552 3.4934 4.5477 3.4614 2.7492 5.3408 1.9366 4.0637 6.1052 3.1081 4.7457 2.4339 1.5778 1.2653 1.6263 4.1872 4.1966 2.5084 4.3340 8.7038 6.1964 5.6967 2.3901 4.8537 4.4855 2.7263 5.1344 2.6104 1.5646 4.6973 5.5047 4.4679 4.7282 9.2444 5.3582 3.2699 7.1023 1.0858 1.1395 1.1837 1.3721 3.8441 1.4566 1.5284 4.4530 2.0398 1.1544 2.0256 7.7123 2.5181 6.4971 7.9392 2.4430 2.6411 2.6910 2.0643 1.7543 2.1462 2.9197 1.6664 2.2235 1.4525 2.0353 1.7692 1.7184 2.0751 2.5437 1.7026 1.2550 1.1154 1.2256 1.1045 2.6443 1.4135 1.3512 1.3463 1.2400 4.4649 1.3545 1.2691 1.4333 1.3459 1.2746 1.2192 4.7230 1.8290 1.1225 1.0518 1.0863 1.1092 1.0759 1.1223 1.0649 1.0702 1.0431 1.2019 1.2388 1.5484 1.1781 7.3507 8.3607 9.5131 1.0717 1.0693 1.0551 1.0350 1.0363 1.0372 1.0597 1.0601 1.1063 1.0817 1.0623 1.0968 1.0954 1.1018 1.0990 1.1004 1.0998 1.1031 1.0988 1.1005 1.1089 1.0921 1.0931 1.0762
irintensity: 0.1531 0.2596 0.6890 0.5921 0.4035 0.1544 1.2375 4.4232 0.3959 0.0608 0.4120 0.5861 2.4342 1.4584 0.6293 2.1941 2.6600 1.1115 2.6827 0.6431 0.2421 1.1270 0.1489 0.6909 1.7677 2.2201 4.8218 22.8033 12.8759 6.5567 3.6150 3.2656 1.0903 4.7657 11.4981 1.1714 38.7896 54.7351 24.9242 2.7824 5.3970 13.9204 26.5411 23.9197 0.9558 90.4683 10.9931 5.0570 0.8676 18.1947 6.6635 13.2883 33.9666 8.5606 4.2767 2.4115 4.7086 10.7796 19.8712 276.8839 94.3774 30.7332 81.5958 116.5744 39.6964 22.4618 37.0091 22.2543 15.1540 1.0325 0.3369 425.9761 190.0861 24.2190 31.9801 176.9485 21.9011 0.5743 0.4978 17.3148 0.3489 31.7449 1.1471 6.8821 4.2980 10.1364 46.6588 10.1014 19.0986 13.9782 1.2404 24.3307 25.5092 18.4465 57.2169 7.7105 12.3282 52.9517 67.2639 2.9054 58.2102 18.3716 4.1713 12.6317 196.7640 166.2529 157.9444 71.8104 66.9762 133.7788 204.0448 87.9092 63.8256 28.4996 29.0080 35.5695 25.0607 46.8064 22.9485 22.6051 27.5651 16.7993 6.6457 19.3440 0.1855 47.0459 66.7315 48.4228 78.6732 41.1663 43.2243 32.9840 1.8460 1.2402 42.5031
temp: 298.150 k
press: 1.00000 atm
elementType: 17 17 8 8 8 7 7 6 6 6 6 6 6 6 6 6 6 6 6 6 6 6 6 1 1 1 1 1 1 1 1 1 1 1 1 1 1 1 1 1 1 1 1 1 1 1 1
symmnumber: 1
zpe: 996074.2 jmol-1
zpe.correction: 0.379385 hartree
zpe.thermalcorrener: 0.405327 hartree
zpe.thermalcorrenthalpy: 0.406272 hartree
zpe.thermalcorrgfe: 0.319552 hartree
zpe.sumelectzpe: -1877.590992 hartree
zpe.sumelectthermal: -1877.565049 hartree
zpe.sumelectthermalent: -1877.564105 hartree
zpe.sumelectthermalfe: -1877.650824 hartree
dipole: -1.6410 0.4409 -1.1313
dipole: 2.0414
quadrupole: -103.9836 -156.1268 -152.5468
quadrupole: 10.9090 -2.9035 0.8436
quadrupole: 33.5688 -18.5744 -14.9944 10.9090 -2.9035 0.8436
hfenergy: -1877.9703762 hartree
pointgroup: C01 [X(C16H24Cl2N2O3)]
dipole: -0.6589723 -0.2813433 0.3627955 debye
polarizability: 324.3775397|-14.225464|203.998519|15.7429632|20.0082493|163.7250175 unknown
InChI: InChI=1S/C16H24Cl2N2O3/c1-4-8-22-12-10-13(17)15(14(18)11-12)19-16(21)23-9-7-20(5-2)6-3/h10-11,19H,4-9H2,1-3H3
charge 0 multiplicity 1
47 atoms
Cl -1.292263 1.839783 1.779419
Cl -1.080234 -3.052722 -0.90585
O  2.321518 -0.288747 0.59883
O  -5.416207 -0.297015 -0.654147
O  0.892579 1.202868 -0.542178
N  5.950538 0.395571 -0.010585
N  0.098376 -0.697381 0.625288
C  4.741664 -0.330787 0.444135
C  7.121049 0.264232 0.891084
C  6.230216 0.211752 -1.457519
C  3.496383 0.532475 0.195417
C  7.779957 -1.14164 0.961691
C  7.192376 1.268006 -2.031801
C  -1.283098 -0.559251 0.336339
C  1.073729 0.180844 0.155733
C  -6.214886 0.892559 -0.28444
C  -4.070551 -0.322874 -0.287758
C  -7.625711 0.674027 -0.833751
C  -2.054263 0.555194 0.752219
C  -1.993525 -1.567991 -0.374267
C  -3.417655 0.704624 0.436631
C  -3.355137 -1.482026 -0.681737
C  -8.553251 1.862482 -0.497472
H  4.82278 -0.534785 1.52738
H  4.608038 -1.316435 -0.059721
H  7.879167 1.008286 0.584474
H  6.791163 0.561884 1.904876
H  6.623289 -0.812243 -1.680936
H  5.264714 0.29203 -1.991578
H  3.520731 1.451325 0.80631
H  3.388515 0.81991 -0.865338
H  7.051393 -1.909765 1.281117
H  8.194311 -1.44906 -0.015779
H  8.610234 -1.137416 1.692415
H  6.81725 2.283496 -1.813975
H  8.210188 1.17767 -1.611319
H  7.275099 1.150385 -3.12794
H  -6.229402 0.997386 0.820445
H  -5.750093 1.798844 -0.72519
H  -8.033485 -0.26241 -0.410005
H  -7.564916 0.532843 -1.92869
H  0.436468 -1.569629 1.037327
H  -3.946539 1.597441 0.775132
H  -3.870323 -2.273224 -1.23045
H  -8.644463 2.007546 0.595392
H  -8.176148 2.805905 -0.93471
H  -9.567274 1.689429 -0.898117
