program: Gaussian 09
title: 000292137
version: EM64L-G09RevD.01
frameworkgroup: C1[X(C12H12N2O4)]
method: RPBEPBE
basis: SDD
operation: Freq
keyword: #p
keyword: freq=noraman
keyword: PBEPBE/SDD
title: #p freq=noraman PBEPBE/SDD
converged: YES YES NO NO
title: Mulliken charges:
elementType: O O O O N N C C C C C C C C C C C C H H H H H H H H H H H H
charge: -0.289504 -0.225653 -0.215438 -0.244642 0.048132 0.004942 0.163269 -0.055377 -0.256582 -0.256137 -0.012268 0.194774 0.207601 -0.257309 -0.258221 -0.661346 -0.664993 -0.150506 0.294090 0.285974 0.227653 0.241699 0.233953 0.233262 0.224855 0.254306 0.227642 0.221717 0.237323 0.246784
chargesum: 0.00000
title: Mulliken charges with hydrogens summed into heavy atoms:
elementType: O O O O N N C C C C C C C C C C C C
charge: -0.289504 -0.225653 -0.215438 -0.244642 0.048132 0.004942 0.163269 -0.055377 0.037508 0.029836 -0.012268 0.194774 0.207601 0.212043 0.208994 0.045459 0.040831 -0.150506
polarizability: 2.34554994e+02 3.63415948e+00 1.74111187e+02 -4.65328041e+00 3.10351756e+00 8.43847115e+01
1716.lowfreq: -8.1753 -4.3900 0.0003 0.0004 0.0007 8.3415 21.9878 28.5472 40.3390
frequency: 21.8455 28.2808 40.3028 62.3166 66.3735 81.2635 101.3432 106.1341 128.7619 144.3373 173.6067 214.0509 215.3831 247.4781 265.0993 304.2893 318.8813 337.1093 371.3525 403.7602 418.8991 437.7929 461.1021 475.7945 533.4727 587.7559 608.9736 657.4475 687.0962 727.8352 744.5176 746.6832 802.5601 815.9938 817.9962 818.7935 829.8726 894.3450 902.4523 987.6561 1002.8779 1020.2278 1026.9136 1093.7073 1095.6669 1100.6970 1122.1022 1156.2730 1158.0876 1190.2527 1239.4022 1276.5492 1278.2705 1280.0004 1301.1972 1350.9118 1357.3079 1358.0650 1391.5898 1392.5306 1432.1203 1458.1250 1458.6060 1462.4801 1463.3023 1484.5005 1484.5821 1537.9271 1571.8346 1599.0681 1624.5242 2191.6651 2995.7852 2995.9257 3032.9457 3035.0020 3091.1498 3091.3870 3098.1284 3099.1293 3124.0350 3125.3072 3175.9192 3195.0301
redmass: 4.3643 5.7138 3.5919 3.8462 6.1333 4.3201 3.3014 4.3603 4.3025 8.2852 3.3957 1.6289 1.3135 2.6817 7.4504 2.8874 3.5506 5.1493 6.2765 5.9459 6.8680 4.5205 5.6629 4.2326 7.6477 7.6733 7.4367 7.3439 8.9647 4.0061 4.8895 3.0772 2.2248 6.4938 1.4257 1.9760 3.3540 1.4966 5.1766 3.0916 2.5954 1.3696 4.7146 2.4820 2.1579 3.6677 1.9122 1.6634 1.6992 2.4193 2.5881 1.5276 1.1222 2.3536 5.9505 4.7747 1.3874 1.3726 1.2294 1.2276 3.3816 1.1053 1.1011 1.0455 1.0469 1.0523 1.0526 6.7882 6.9250 9.4397 10.3207 12.6445 1.0361 1.0361 1.0604 1.0595 1.0974 1.0976 1.1033 1.1022 1.1066 1.1064 1.0904 1.0972
irintensity: 1.6385 0.8804 0.7173 0.2176 2.7952 0.1603 2.5619 5.7287 1.1411 0.8229 1.7908 1.5836 4.0025 0.8174 0.6929 31.4981 0.7655 7.3603 1.4526 4.3008 7.1750 0.4646 2.1557 4.0422 6.9885 6.1488 0.8715 1.2605 4.9673 7.6262 22.9596 17.7852 0.1814 3.1784 5.5536 4.9993 2.0287 26.1414 3.2043 22.5929 48.4277 0.0536 226.3835 255.5343 1.2757 245.4880 18.6897 38.7009 37.1888 0.0029 322.8682 17.3769 2.5007 101.9173 38.6820 0.0305 5.6665 6.7785 23.0134 22.9615 54.8600 7.4080 24.2129 14.4684 15.4354 10.9911 16.5817 9.7854 27.3486 143.6942 132.6164 2.3303 22.6353 13.5014 30.2871 28.6255 37.9564 28.8350 0.9969 2.9592 26.3118 25.0462 0.6019 0.0206
temp: 298.150 k
press: 1.00000 atm
elementType: 8 8 8 8 7 7 6 6 6 6 6 6 6 6 6 6 6 6 1 1 1 1 1 1 1 1 1 1 1 1
symmnumber: 1
zpe: 583838.2 jmol-1
zpe.correction: 0.222372 hartree
zpe.thermalcorrener: 0.240535 hartree
zpe.thermalcorrenthalpy: 0.241480 hartree
zpe.thermalcorrgfe: 0.173489 hartree
zpe.sumelectzpe: -873.542317 hartree
zpe.sumelectthermal: -873.524154 hartree
zpe.sumelectthermalent: -873.523210 hartree
zpe.sumelectthermalfe: -873.591200 hartree
dipole: 0.6470 -5.3833 -0.2759
dipole: 5.4290
quadrupole: -71.3734 -123.7623 -101.6641
quadrupole: -17.6223 -1.0948 0.1612
quadrupole: 27.5598 -24.8290 -2.7308 -17.6223 -1.0948 0.1612
hfenergy: -873.7646892 hartree
pointgroup: C01 [X(C12H12N2O4)]
dipole: 0.2331835 -1.8010232 -1.1243613 debye
polarizability: 234.7504394|3.3673292|149.9816406|-0.0756783|39.8910914|108.3188126 unknown
InChI: InChI=1S/C12H12N2O4/c1-3-17-11(15)8-5-6-9(12(16)18-4-2)14-10(8)7-13/h5-6H,3-4H2,1-2H3
charge 0 multiplicity 1
30 atoms
O  3.498332 -0.795024 -0.564437
O  -3.642445 0.160921 0.74934
O  3.337621 1.154451 0.712529
O  -3.4192 -1.746592 -0.57844
N  -0.962481 0.589949 0.72125
N  1.021502 3.000323 2.054416
C  1.321043 -0.080721 0.097907
C  -1.432704 -0.509931 0.069945
C  0.798862 -1.216356 -0.571845
C  -0.588802 -1.438558 -0.59121
C  0.391031 0.801294 0.735391
C  2.794087 0.183758 0.1366
C  -2.920336 -0.768203 0.036898
C  4.991759 -0.654245 -0.580281
C  -5.133522 -0.007668 0.749544
C  5.608442 -1.294284 0.665578
C  -5.74823 0.67812 -0.472897
C  0.79447 1.997172 1.447755
H  1.492055 -1.9012 -1.064726
H  -1.03688 -2.298005 -1.096114
H  5.28579 -1.173156 -1.506156
H  5.237603 0.41985 -0.646879
H  -5.365532 -1.087078 0.769809
H  -5.438484 0.470921 1.692935
H  6.710879 -1.25522 0.590373
H  5.308698 -0.752185 1.577672
H  5.307521 -2.351924 0.758548
H  -6.850927 0.632446 -0.404815
H  -5.449064 1.739028 -0.519023
H  -5.440389 0.176019 -1.405266
