program: Gaussian 09
title: 000292130
version: EM64L-G09RevD.01
frameworkgroup: C1[X(C9H8BrClO)]
method: RPBEPBE
basis: SDD
operation: Freq
keyword: #p
keyword: freq=noraman
keyword: PBEPBE/SDD
title: #p freq=noraman PBEPBE/SDD
converged: NO YES NO NO
title: Mulliken charges:
elementType: Br Cl O C C C C C C C C C H H H H H H H H
charge: -0.031837 -0.032716 -0.219431 -0.442748 0.304743 0.119150 -0.325543 -0.329916 -0.685797 -0.219448 -0.213919 -0.101122 0.262243 0.261943 0.253029 0.284509 0.295937 0.295708 0.261660 0.263556
chargesum: 0.00000
title: Mulliken charges with hydrogens summed into heavy atoms:
elementType: Br Cl O C C C C C C C C C
charge: -0.031837 -0.032716 -0.219431 0.081438 0.304743 0.119150 -0.072514 -0.045407 -0.094152 0.042212 0.049637 -0.101122
polarizability: 2.03079832e+02 -4.75043671e+00 1.21047129e+02 -1.91794425e-02 -2.91228599e-02 5.29201536e+01
1716.lowfreq: -3.8261 0.0008 0.0018 0.0026 4.3663 5.1891 34.1806 59.0818 61.7993
frequency: 34.1062 59.0806 61.4868 83.9009 104.8295 166.1033 198.6251 252.5591 289.1777 302.5204 407.1172 430.7880 459.5467 506.0033 570.3551 570.4512 622.0996 703.3885 716.0892 770.2615 793.3180 828.7265 849.4554 952.9817 970.7422 972.6635 994.7777 1001.4008 1072.4862 1083.3459 1112.1707 1112.5177 1185.7386 1199.3050 1248.8606 1270.5195 1295.2845 1320.0456 1371.7294 1400.6149 1439.5829 1450.4552 1476.2576 1558.1089 1587.7623 1601.3824 2991.6153 3044.7162 3080.8484 3150.9556 3155.5356 3166.6573 3173.3700 3176.7076
redmass: 4.9211 12.8043 2.5363 7.2510 2.9909 13.4060 8.1774 6.1000 6.6036 7.7623 2.8841 5.9327 3.2925 7.1752 2.7391 4.6628 7.1434 6.5745 3.1692 1.3480 5.1562 1.3302 1.3637 1.4471 1.4591 5.8593 1.3631 3.6692 2.7105 3.3753 1.3741 1.2032 1.1440 1.4570 1.8033 1.1515 1.2773 1.8629 5.2028 4.1420 1.1252 1.0978 2.3025 7.9473 7.1826 6.9755 1.0603 1.0994 1.0571 1.0885 1.0887 1.1111 1.0963 1.0976
irintensity: 0.4356 0.5317 0.8349 6.9693 0.7102 0.9038 10.1274 0.0002 6.2312 1.2905 0.0395 5.4989 12.4509 36.8548 18.3939 34.4891 1.0127 24.4361 0.1618 40.4915 1.6013 17.0545 32.5022 0.6039 0.1819 75.7876 0.9679 17.9792 67.8593 0.6119 10.8590 0.3442 31.1797 44.7728 77.2740 1.7158 2.6442 168.9724 22.8845 25.3740 22.0325 7.4514 12.7273 138.3069 114.7055 43.9165 26.7315 4.4952 5.2100 5.6690 0.2805 4.1049 4.9714 1.4717
temp: 298.150 k
press: 1.00000 atm
elementType: 35 17 8 6 6 6 6 6 6 6 6 6 1 1 1 1 1 1 1 1
symmnumber: 1
zpe: 379211.0 jmol-1
zpe.correction: 0.144434 hartree
zpe.thermalcorrener: 0.156277 hartree
zpe.thermalcorrenthalpy: 0.157221 hartree
zpe.thermalcorrgfe: 0.103250 hartree
zpe.sumelectzpe: -895.633656 hartree
zpe.sumelectthermal: -895.621813 hartree
zpe.sumelectthermalent: -895.620868 hartree
zpe.sumelectthermalfe: -895.674840 hartree
dipole: 1.8221 -1.1160 0.0030
dipole: 2.1367
quadrupole: -100.4927 -86.6736 -87.8295
quadrupole: 1.8915 -0.0190 -0.0221
quadrupole: -8.8275 4.9917 3.8358 1.8915 -0.0190 -0.0221
hfenergy: -895.7780895 hartree
pointgroup: C01 [X(C9H8Br1Cl1O1)]
dipole: 0.7504183 0.3788532 0.0056716 debye
dipolederiv: -0.5004193 0.1165461 0.0012934 0.2718304 -0.2660576 -0.0016042 0.0040376 -0.0019232 -0.1449746 -0.9358451 -0.1686097 -0.0042935 -0.1918422 -0.1518164 -0.0016832 -0.0046885 -0.0016452 -0.0550851 -0.9615702 -0.0899247 -0.0026865 -0.442394 -0.7968059 -0.0085908 -0.0074125 -0.007399 -0.2994797 -0.3436342 0.1214487 0.000847 0.548985 -0.3239065 -0.0061675 0.0081568 -0.0070421 0.1125106 -0.9910299 -0.1210256 -0.0037322 -0.0213833 -0.158932 -0.0020138 -0.0025872 -0.0020648 -0.0285422 1.9064443 0.1044286 0.0051312 0.1541354 0.8957412 0.012197 0.0055537 0.0115733 0.1363791 0.2459175 -0.0386472 0.0003059 0.22247 0.0638521 0.0029809 0.003874 0.0022536 -0.1161506 0.1859456 0.1530969 0.0026757 -0.2032179 0.0492021 0.0012342 -0.0022631 0.0021784 -0.0893621 0.6471167 -0.3119041 -0.0043371 -0.4567368 0.3983818 0.0043288 -0.0066616 0.0046085 0.1090531 -0.5798636 0.0324996 -0.0007217 0.1301247 0.0267464 0.0019398 0.0005089 0.0017267 -0.1061316 -0.3628941 -0.2386667 -0.0035788 -0.2765923 -0.1188823 -0.0009314 -0.0040638 -0.0008208 -0.1066646 1.3917783 0.2517745 0.0067621 0.2476771 0.271782 0.0047202 0.0067504 0.0046982 -0.0510987 0.0433829 -0.0148042 -0.0486695 -0.079484 0.0479637 -0.0669923 -0.0687517 -0.0681634 -0.0028572 0.0430471 -0.0169259 0.0484936 -0.0820503 0.0433122 0.0684064 0.0661886 0.0698531 0.0021027 0.0165193 0.088773 0.0008003 0.1071631 0.0147967 -0.0014392 0.0010023 -0.0013993 0.1426135 0.121113 -0.0584468 -0.0008274 -0.0024467 0.0199653 -0.0016523 -0.0000227 -0.0018928 0.1536911 -0.0010698 0.0816661 -0.002153 0.0285099 -0.0197827 0.0763091 0.0297138 0.0550637 0.008486 -0.001529 0.0816458 0.0049902 0.0301985 -0.0153246 -0.0771733 -0.0288605 -0.0558127 0.0033346 0.0686402 -0.0432436 -0.0007805 -0.0462068 -0.0184086 -0.002437 -0.0008295 -0.0024364 0.1664493 0.0079504 0.0703192 0.0004805 0.0612603 0.0381733 -0.0014312 0.0003549 -0.0013558 0.1657265 unknown
polarizability: 203.3046205|-2.0115748|120.8084152|0.2591559|0.953472|52.9340789 unknown
InChI: InChI=1S/C9H8BrClO/c10-6-5-9(12)7-1-3-8(11)4-2-7/h1-4H,5-6H2
charge 0 multiplicity 1
20 atoms
Br -5.107852 1.34312 0.012025
Cl 4.692187 0.757086 0.020539
O  -1.60979 -1.904108 -0.031817
C  -2.330274 0.424484 0.001181
C  0.180135 -0.288401 -0.004252
C  -1.266901 -0.683698 -0.013473
C  0.605689 1.067692 0.014157
C  1.1605 -1.319073 -0.014686
C  -3.743586 -0.159577 -0.01225
C  1.977936 1.391306 0.021618
C  2.533552 -1.011923 -0.00714
C  2.922291 0.344819 0.010835
H  -2.186371 1.057799 0.89797
H  -2.181585 1.086731 -0.873651
H  -0.123105 1.884295 0.022804
H  0.819398 -2.359256 -0.028853
H  -3.958771 -0.768672 0.875963
H  -3.955136 -0.736218 -0.922738
H  2.309656 2.433366 0.035527
H  3.288225 -1.803671 -0.014959
