program: Gaussian 09
title: 000292114
version: EM64L-G09RevD.01
frameworkgroup: C1[X(C9H9ClO2)]
method: RPBEPBE
basis: SDD
operation: Freq
keyword: #p
keyword: freq=noraman
keyword: PBEPBE/SDD
title: #p freq=noraman PBEPBE/SDD
converged: YES YES NO NO
title: Mulliken charges:
elementType: Cl O O C C C C C C C C C H H H H H H H H H
charge: -0.058372 -0.390100 -0.314451 0.168134 -0.481035 0.229859 0.136367 -0.273553 -0.677158 -0.334085 -0.154657 -0.191884 0.240298 0.240051 0.269267 0.232439 0.214833 0.232394 0.265579 0.262058 0.384015
chargesum: 0.00000
title: Mulliken charges with hydrogens summed into heavy atoms:
elementType: Cl O O C C C C C C C C C
charge: -0.058372 -0.006084 -0.314451 0.168134 -0.000686 0.229859 0.136367 -0.004286 0.002508 -0.068506 -0.154657 0.070173
polarizability: 1.64146933e+02 2.29737503e+00 1.28816271e+02 -4.95585871e-03 -3.28104110e-03 5.33732830e+01
1716.lowfreq: -7.2961 -1.0963 -0.0023 -0.0019 0.0003 8.5044 59.6590 83.7188 126.4605
frequency: 59.6542 83.7147 126.4605 131.2870 152.3863 194.9511 233.3188 319.6146 319.9607 346.7342 360.5211 422.2761 436.9919 500.0899 504.0359 580.9884 628.1402 656.6835 724.1362 749.7467 805.3653 824.9747 828.3874 880.3976 944.2284 958.3779 960.6816 1019.6698 1072.9867 1076.1048 1089.2897 1129.4150 1216.8647 1248.7803 1252.2534 1269.4152 1310.7975 1372.9411 1390.6437 1399.3281 1404.1899 1439.8994 1462.3055 1469.0177 1478.0750 1552.4496 1571.3239 1630.1385 2786.4590 2973.2116 3002.1130 3017.8186 3099.0636 3106.0574 3163.1024 3172.5138 3184.5164
redmass: 2.8893 2.3581 4.8657 3.5080 7.2641 1.3090 4.9013 6.7144 4.6883 9.2076 7.1146 3.3618 10.0102 4.2404 2.9154 2.7088 8.1300 4.8201 3.1080 4.9323 1.4101 6.2210 1.5765 1.4475 1.0780 4.0572 1.3337 1.6408 1.6231 2.0584 3.0274 1.4780 1.7339 1.1757 1.9733 2.6608 1.7793 2.2522 2.5572 2.6647 2.2154 1.2177 2.2156 1.0390 1.0573 4.7843 3.8553 4.9917 1.0703 1.0603 1.0363 1.0977 1.1004 1.1001 1.0892 1.0920 1.0975
irintensity: 0.0717 2.9040 1.2558 0.0632 0.1627 0.6013 0.8890 0.3837 4.0241 2.6867 9.3279 1.2379 7.9624 10.6664 11.7588 9.0148 28.5401 13.2003 1.5727 21.7067 4.8303 14.0221 66.0878 7.4629 126.5296 38.1818 1.2137 6.1265 1.5142 5.4140 14.7827 0.0040 97.4190 0.5009 121.3443 117.6065 61.6177 153.5974 1.1651 49.2473 8.8056 68.3381 153.5002 12.6133 17.9434 49.7505 48.4161 77.1705 306.3296 28.5305 26.0395 6.8786 24.4013 27.5626 0.6483 0.8285 2.8811
temp: 298.150 k
press: 1.00000 atm
elementType: 17 8 8 6 6 6 6 6 6 6 6 6 1 1 1 1 1 1 1 1 1
symmnumber: 1
zpe: 413279.0 jmol-1
zpe.correction: 0.157410 hartree
zpe.thermalcorrener: 0.168740 hartree
zpe.thermalcorrenthalpy: 0.169684 hartree
zpe.thermalcorrgfe: 0.119534 hartree
zpe.sumelectzpe: -957.999524 hartree
zpe.sumelectthermal: -957.988193 hartree
zpe.sumelectthermalent: -957.987249 hartree
zpe.sumelectthermalfe: -958.037399 hartree
dipole: -0.1491 -1.9273 0.0049
dipole: 1.9331
quadrupole: -80.7390 -77.3308 -78.7505
quadrupole: -11.6578 0.0127 -0.0019
quadrupole: -1.7989 1.6093 0.1896 -11.6578 0.0127 -0.0019
hfenergy: -958.1569333 hartree
pointgroup: C01 [X(C9H9Cl1O2)]
dipole: 0.0771897 0.7565394 -0.0093527 debye
dipolederiv: -0.4226077 0.2969425 0.0180999 0.4214882 -0.5133931 -0.020911 0.0176028 -0.0142362 -0.0657292 -0.7091532 0.4673638 0.015661 0.2804558 -1.0119151 -0.0124824 0.0162637 -0.02283 -0.3852863 -1.0611756 0.0443596 0.0396665 0.4017088 -0.7022849 -0.01906 0.0378487 -0.0001435 -0.3158735 -1.0960273 -0.2885353 0.0573437 -0.0764138 -0.2915484 0.0052041 0.0562721 0.0165297 -0.0572331 -0.0082752 -0.0389065 0.0074886 -0.2740726 -0.3244411 0.0178351 0.0098134 0.0060213 0.1273112 1.7501112 0.234024 -0.0883649 0.136438 0.8063746 -0.0119876 -0.0882854 -0.0171895 0.132234 0.5206589 -0.7011304 -0.0190296 -0.2143718 0.7994829 0.0088044 -0.021351 0.0348976 0.1151461 0.2904968 0.2612226 -0.020428 -0.1461227 -0.1738044 0.0081451 -0.0182647 -0.0135158 -0.0677511 -0.0236426 0.0076484 0.004449 -0.0204786 0.0827333 0.0009737 0.0044075 -0.0007315 0.0618131 -0.1339431 0.4176905 -0.0039602 0.0524249 -0.0437752 -0.0033412 -0.0023451 -0.0229588 -0.174953 0.1806593 -0.7107658 -0.0123758 -0.8688851 0.5685001 0.0442196 -0.0118056 0.0356817 -0.1011391 0.0104063 0.0789901 -0.0044507 0.3290272 0.1610722 -0.0187252 -0.0053919 -0.0052434 -0.0664434 -0.0316396 0.0104438 -0.0873675 0.0271263 0.0516607 0.0548209 -0.0929071 0.0678676 -0.0061049 -0.0126751 0.0048404 0.088286 0.0228886 0.0498531 -0.0585624 0.0930923 -0.0700126 -0.0231868 0.1105731 -0.0578096 0.0021936 -0.0492749 -0.0047733 0.0033151 0.0021587 0.0036786 0.1471627 0.0563488 0.0091804 0.0332129 0.0716706 0.0597359 -0.1035108 0.0591069 -0.0776751 -0.0618902 0.0021457 -0.0781768 0.0059262 -0.1499815 -0.1345806 0.009358 0.0063022 0.0055767 0.1052836 0.0453991 0.0165692 -0.0447288 0.0810995 0.0618356 0.0940974 -0.0713504 0.0748861 -0.0532495 0.064304 -0.0187532 0.0058856 -0.0498945 -0.0253406 0.0034929 0.0059972 0.001795 0.1717117 -0.033471 -0.0209014 0.0104886 -0.0043069 0.1134273 0.0004231 0.010359 0.0013114 0.158968 0.5015072 0.0657038 -0.0079961 0.0294744 0.471181 -0.0021087 -0.0075233 -0.0037091 0.3592097 unknown
polarizability: 161.9050329|-8.359324|130.7459943|-5.8071161|0.11257|53.6854591 unknown
InChI: InChI=1S/C9H9ClO2/c1-2-8(11)7-5-6(10)3-4-9(7)12/h3-5,12H,2H2,1H3
charge 0 multiplicity 1
21 atoms
Cl -3.183382 2.283459 0.051802
O  0.367323 -2.565889 -0.119552
O  2.372931 -1.032399 -0.231896
C  0.169119 -0.11206 -0.119205
C  2.290058 1.402258 -0.242147
C  1.636353 0.026929 -0.19845
C  -0.408697 -1.434554 -0.08252
C  -0.69972 1.019451 -0.077257
C  3.825457 1.348874 -0.321523
C  -1.818479 -1.591532 -0.005939
C  -2.080643 0.830363 -0.001896
C  -2.654908 -0.465884 0.034506
H  1.877411 1.957478 -1.109245
H  1.968956 1.970788 0.654567
H  -0.290455 2.032659 -0.103558
H  4.157114 0.808688 -1.22409
H  4.24222 2.371039 -0.349507
H  4.249285 0.819607 0.548342
H  -2.228513 -2.604541 0.020266
H  -3.740847 -0.583916 0.093499
H  1.353019 -2.253223 -0.173299
