program: Gaussian 09
title: 000292112
version: EM64L-G09RevD.01
frameworkgroup: C1[X(C9H10N4S)]
method: RPBEPBE
basis: SDD
operation: Freq
keyword: #p
keyword: freq=noraman
keyword: PBEPBE/SDD
title: #p freq=noraman PBEPBE/SDD
converged: NO NO NO NO
title: Mulliken charges:
elementType: S N N N N C C C C C C C C C H H H H H H H H H H
charge: 0.276364 -0.166149 -0.109069 -0.559601 -0.095764 0.471111 -0.797438 -0.375190 -0.375115 -0.065012 -0.220774 -0.220775 -0.235129 -0.210945 0.298626 0.298525 0.239092 0.239111 0.228281 0.228283 0.230465 0.273924 0.323565 0.323615
chargesum: 0.00000
title: Mulliken charges with hydrogens summed into heavy atoms:
elementType: S N N N N C C C C C C C C C
charge: 0.276364 -0.166149 -0.109069 0.087579 -0.095764 0.471111 -0.200287 -0.136098 -0.136004 -0.065012 0.007507 0.007508 -0.004664 0.062979
polarizability: 2.18300142e+02 -1.08040274e+01 1.04593112e+02 -9.68600061e-03 -9.55602861e-03 1.04542550e+02
1716.lowfreq: -16.5672 -5.9801 -3.8553 -0.0023 -0.0019 0.0012 13.3005 25.2117 55.1005
frequency: 9.9431 25.0267 55.0586 61.4673 125.4491 184.3148 192.1786 246.0404 254.7559 286.5228 322.3207 359.1347 401.0462 427.1961 464.6124 500.8050 554.5038 616.4412 625.3681 634.2104 656.3851 701.0653 706.6330 764.1777 776.0498 810.6857 851.2344 884.4206 886.4766 896.6847 927.0127 976.9289 990.3510 997.1093 1025.9729 1073.9122 1103.4754 1125.0500 1160.6202 1173.3498 1187.5547 1222.4358 1226.7422 1242.6341 1252.2987 1324.3751 1347.3391 1365.4388 1385.9108 1427.5799 1440.7176 1449.2246 1483.9418 1593.8523 1615.1558 1642.6127 3055.4375 3123.9428 3126.0131 3132.2782 3138.8899 3150.2718 3166.7888 3243.9817 3496.0036 3644.1952
redmass: 5.2549 4.0845 5.8830 5.2736 7.1936 5.3513 4.9223 4.4541 5.3185 1.1505 2.2483 1.2789 2.7948 7.1252 4.4118 7.7261 6.0865 6.3278 3.8593 4.6219 10.5582 1.8184 4.7229 1.3875 2.1624 3.9408 1.2506 7.3638 1.5248 11.7865 1.4582 1.3925 6.2168 1.3213 2.1874 1.4861 4.5038 1.0822 1.6585 1.0523 1.1115 2.0103 1.2150 2.9176 2.3248 1.2806 10.6499 9.6080 8.8317 4.5891 2.2065 1.1191 2.3800 6.1071 6.1700 1.0960 1.0583 1.0851 1.0892 1.1079 1.0921 1.0965 1.1017 1.0999 1.0406 1.1072
irintensity: 0.0507 3.7419 2.8740 7.2920 7.1078 2.3513 2.3690 3.6843 5.1216 23.4902 0.7478 253.4332 0.0034 0.7181 6.4420 10.6255 21.9703 0.1374 11.1807 34.8679 2.2370 55.3627 7.3426 25.8461 27.0937 9.7530 0.0034 1.0175 0.2311 4.7233 2.5776 0.0038 0.4398 0.0694 6.2849 8.9629 45.8644 1.3739 17.5764 0.0196 1.1274 0.6279 0.0609 14.2354 19.6000 0.2267 124.4394 27.3523 0.2032 2.9483 8.7554 11.8032 11.1307 0.9128 0.8219 22.5069 5.0727 5.3969 0.3380 2.1214 14.5816 39.7019 23.3917 0.0318 8.6515 20.6563
temp: 298.150 k
press: 1.00000 atm
elementType: 16 7 7 7 7 6 6 6 6 6 6 6 6 6 1 1 1 1 1 1 1 1 1 1
symmnumber: 1
zpe: 474436.6 jmol-1
zpe.correction: 0.180703 hartree
zpe.thermalcorrener: 0.193968 hartree
zpe.thermalcorrenthalpy: 0.194912 hartree
zpe.thermalcorrgfe: 0.137565 hartree
zpe.sumelectzpe: -964.942402 hartree
zpe.sumelectthermal: -964.929137 hartree
zpe.sumelectthermalent: -964.928193 hartree
zpe.sumelectthermalfe: -964.985540 hartree
dipole: 0.5098 4.7688 -0.0027
dipole: 4.7960
quadrupole: -66.7497 -96.6479 -82.2409
quadrupole: 20.4285 -0.0096 0.0055
quadrupole: 15.1298 -14.7684 -0.3615 20.4285 -0.0096 0.0055
hfenergy: -965.1231049 hartree
pointgroup: C01 [X(C9H10N4S1)]
dipole: 0.1786139 -1.8784084 -0.0002198 debye
dipolederiv: -0.7178242 -0.0412283 0.0000563 -0.1793416 0.0055438 0.0000832 -0.0003061 0.0001105 -0.0464786 -0.173226 -0.1672936 0.0000213 0.066103 -0.1256699 0.0002698 0.0008623 -0.0004595 -0.0975138 -0.4358107 -0.0542431 -0.0002453 -0.4989898 -0.4402252 -0.000179 0.0000207 0.0000284 -0.1942122 -0.7482992 -0.0417235 -0.000102 -0.1979262 -0.242292 -0.0001676 -0.0002946 -0.0002457 -0.0213841 -0.203746 -0.0241022 0.0000599 0.1185428 -0.2990946 -0.0008589 0.0001581 0.0000518 -0.243095 0.1578445 0.0044589 0.0000019 0.0621802 -0.0898973 -0.0001231 0.0001116 -0.0001357 -0.0132646 0.6574008 -0.1433687 -0.0001325 -0.3464068 0.2058762 0.000239 -0.0002194 0.0002683 0.1045593 -0.0800902 0.0367317 0.0820505 0.0174402 -0.1298168 0.0192087 0.0202595 0.0183845 0.0439637 -0.0800354 0.0368725 -0.0820228 0.0174069 -0.1297351 -0.0195239 -0.0203475 -0.018674 0.0437794 1.1224779 -0.0132207 -0.0004685 0.7034035 0.3178208 0.0003616 0.000233 -0.0001411 0.030925 -0.0519656 0.0353227 -0.097303 0.0219039 -0.1324153 -0.0274285 -0.1215022 -0.019885 0.0788241 -0.0520422 0.0351246 0.0972982 0.0217118 -0.1325032 0.0270731 0.1214443 0.0195104 0.0790375 0.0539671 0.0791379 0.0001116 0.0613433 -0.139735 -0.000064 0.0001049 -0.0000653 -0.0494815 -0.1071472 0.2084939 0.0006693 0.0016943 0.2800965 0.0004947 -0.0011381 0.0006012 -0.0530224 -0.0040728 0.0097554 0.006719 0.0854774 0.0033953 0.0449159 0.0464793 0.0618944 -0.0059637 -0.0042296 0.009808 -0.0066815 0.0855871 0.0035507 -0.0449816 -0.0463368 -0.0619507 -0.0063342 0.0535678 -0.0368287 -0.0972767 -0.0307593 0.1301401 -0.0264634 -0.0923216 -0.0194398 -0.0409149 0.0534874 -0.0370142 0.0972271 -0.0309516 0.1300432 0.0267546 0.0923227 0.0197346 -0.0407003 0.021514 -0.0302479 0.0849823 -0.0411027 0.1482844 0.0227991 0.1071839 0.0229709 -0.0716884 0.0216263 -0.030079 -0.0849696 -0.0408832 0.1483655 -0.0224129 -0.1072012 -0.0225801 -0.0718662 -0.1233422 -0.0719138 -0.0001195 -0.0761068 0.14019 0.0000263 -0.0001265 0.0000285 0.0880949 0.011076 0.0311864 -0.0001186 0.0726189 0.0984357 0.0000005 0.0004918 -0.0001031 0.2023951 0.3145376 0.102366 -0.0869722 0.0535756 0.1248924 -0.0327957 -0.0313796 -0.0255528 0.1420528 0.3143318 0.1020057 0.0872149 0.0534792 0.1247497 0.0327721 0.0315011 0.0256492 0.1422881 unknown
polarizability: 218.5371819|9.4719438|104.3560866|0.0065222|-0.0105771|104.5425353 unknown
InChI: InChI=1S/C9H10N4S/c10-13-7-11-12-9(13)14-6-8-4-2-1-3-5-8/h1-5,7H,6,10H2
charge 0 multiplicity 1
24 atoms
S  0.612345 -0.822964 -0.000094
N  3.412234 -0.71372 -0.00077
N  2.449134 1.329385 0.000724
N  3.512696 -2.105862 -0.002383
N  3.888812 1.492345 -0.000479
C  -1.927152 0.372255 0.001039
C  -0.477105 0.777767 0.001802
C  -2.622954 0.176657 1.222454
C  -2.62226 0.178913 -1.221134
C  2.2064 0.002706 0.000296
C  -3.983975 -0.199261 1.222954
C  -3.983274 -0.197002 -1.223116
C  -4.668184 -0.387384 -0.000449
C  4.422191 0.262388 0.001305
H  -0.17658 1.34358 -0.892527
H  -0.176895 1.341313 0.897665
H  -2.094182 0.321473 2.17204
H  -2.092937 0.325481 -2.170144
H  -4.510192 -0.34278 2.173089
H  -4.508947 -0.338766 -2.173815
H  -5.724774 -0.677199 -0.001014
H  5.483246 0.026704 0.001467
H  3.833584 -2.524811 0.87106
H  3.833767 -2.522914 -0.876669
