program: Gaussian 09
title: 000292103
version: EM64L-G09RevD.01
frameworkgroup: C1[X(C5H11NO)]
method: RPBEPBE
basis: SDD
operation: Freq
keyword: #p
keyword: freq=noraman
keyword: PBEPBE/SDD
title: #p freq=noraman PBEPBE/SDD
converged: YES YES NO NO
title: Mulliken charges:
elementType: O N C C C C C H H H H H H H H H H H
charge: -0.255353 -0.328399 -0.049737 -0.291217 -0.396386 -0.274458 -0.719506 0.202634 0.208507 0.186168 0.194408 0.209357 0.258520 0.195089 0.208362 0.213203 0.210269 0.228539
chargesum: 0.00000
title: Mulliken charges with hydrogens summed into heavy atoms:
elementType: O N C C C C C
charge: -0.255353 -0.069880 0.152898 0.103458 0.007378 0.128993 -0.067495
polarizability: 7.34024358e+01 -3.46401810e+00 6.18421991e+01 -4.12969274e-01 1.98537261e-01 5.27097238e+01
1716.lowfreq: -29.7847 -3.9125 0.0008 0.0009 0.0010 10.7001 152.6131 209.3816 246.9267
frequency: 152.6108 209.3785 246.9251 290.8149 338.0064 415.5785 445.2020 468.9108 562.6896 660.5780 795.3697 840.7409 885.3123 897.3384 959.1882 983.8702 1045.4638 1072.9668 1086.6418 1122.4446 1126.0081 1175.1449 1195.6151 1238.0211 1277.8914 1300.5163 1316.5946 1339.1535 1363.1343 1373.4218 1386.0325 1435.4695 1440.6921 1447.3342 1457.3683 1472.6226 1478.7544 2859.8245 2883.3162 2946.2498 2957.3818 2977.9318 3035.0957 3069.1726 3075.8505 3082.0524 3088.1535 3442.8186
redmass: 2.4671 1.0737 2.0534 2.5066 2.1269 4.1045 3.7640 1.9450 1.8190 1.8067 2.6805 2.4374 2.1241 1.5966 1.7189 2.3101 3.2885 2.1211 2.3087 2.0316 2.0481 2.7515 1.0920 1.2619 1.2029 1.3149 1.2756 1.2442 1.3184 1.4144 1.2391 1.1450 1.2050 1.0993 1.0925 1.0988 1.0528 1.0813 1.0695 1.0665 1.0660 1.0361 1.0908 1.0984 1.0969 1.0980 1.0998 1.0750
irintensity: 0.6887 0.9375 9.7306 2.4153 4.4055 3.8806 5.4382 13.0032 52.8926 71.6859 8.4135 13.3923 2.8981 5.3451 17.2704 11.7216 55.0146 18.5830 9.4598 7.1069 4.5362 14.3943 0.6816 7.6055 0.7792 12.2743 41.2004 2.2694 0.6348 0.8857 19.6353 5.1009 5.2247 9.3436 3.9310 11.2328 8.6763 65.2509 115.9858 58.0380 86.6458 33.5102 51.5188 34.4909 27.2535 35.6590 52.0400 1.5601
temp: 298.150 k
press: 1.00000 atm
elementType: 8 7 6 6 6 6 6 1 1 1 1 1 1 1 1 1 1 1
symmnumber: 1
zpe: 417028.1 jmol-1
zpe.correction: 0.158838 hartree
zpe.thermalcorrener: 0.165899 hartree
zpe.thermalcorrenthalpy: 0.166844 hartree
zpe.thermalcorrgfe: 0.128281 hartree
zpe.sumelectzpe: -326.492029 hartree
zpe.sumelectthermal: -326.484967 hartree
zpe.sumelectthermalent: -326.484023 hartree
zpe.sumelectthermalfe: -326.522586 hartree
dipole: 1.0581 1.7957 -0.1526
dipole: 2.0899
quadrupole: -41.3711 -43.4411 -45.3434
quadrupole: -3.7024 -1.9165 -2.2975
quadrupole: 2.0141 -0.0559 -1.9582 -3.7024 -1.9165 -2.2975
hfenergy: -326.6508665 hartree
pointgroup: C01 [X(C5H11N1O1)]
dipole: -0.445709 0.6855301 0.0862664 debye
dipolederiv: -0.807183 -0.1328148 0.0427726 -0.1207927 -0.6103157 -0.0335871 0.047747 -0.0247982 -0.4100656 -0.5958987 -0.1228397 -0.069826 -0.1317854 -0.3873637 0.0896084 -0.0912973 0.1616838 -0.5730498 0.1546765 0.1134167 -0.0543715 0.2527897 0.3388859 -0.1141244 -0.0511575 -0.0994184 0.3862785 0.6044537 0.1236786 0.0242252 -0.0395918 0.2532228 0.0231816 0.0718734 0.0740132 0.3513754 0.4452105 0.1174066 0.1307807 -0.0292993 0.0094022 -0.0282972 0.1168774 -0.0335916 0.366889 0.3684864 0.1037319 -0.0408028 0.2395602 0.4910364 -0.0284204 -0.1374061 -0.0530518 0.3729836 -0.0904103 -0.0473114 -0.038823 0.0167487 0.0543378 -0.0094576 -0.0081065 0.0065936 0.0644642 -0.0056126 -0.0158807 -0.0438557 -0.0481604 -0.0352604 0.0054073 0.0511818 0.0651724 -0.285067 -0.0010741 -0.0870782 0.0248281 -0.0859903 -0.1023556 0.0506748 0.0436399 0.1000374 0.0520789 -0.0324373 -0.0102614 -0.0131173 0.0289809 0.0729445 0.025114 -0.0770999 -0.0777296 -0.2065312 -0.0671184 -0.0116676 -0.0202901 0.0306853 0.0560546 0.0079788 -0.1394021 -0.0826941 -0.2690448 -0.0120024 -0.0818848 0.0230895 -0.1313649 -0.1181138 0.062114 0.0355174 0.0942601 0.0523045 0.0547473 0.0739875 0.0432369 0.0506151 0.0192815 -0.0428157 0.1164958 -0.151863 0.266619 0.0715037 -0.018747 -0.0432182 -0.0486732 -0.01916 -0.0090074 0.0897075 0.0209225 -0.2224148 -0.1765622 -0.0145052 -0.0386881 -0.0045439 0.0477571 0.0042241 -0.0882907 0.0071633 0.0714577 0.0182478 -0.0759059 0.0168446 -0.1376291 -0.082785 0.0715745 0.0430438 0.0811366 0.067489 -0.0151411 0.0815601 0.0285301 0.152264 -0.0864164 -0.0749337 0.0375098 -0.0813924 0.0608826 0.0861141 0.0051154 0.0286851 0.0061872 0.0988479 0.0007663 -0.0608337 -0.0064438 -0.1466492 unknown
polarizability: 73.0836573|3.9564004|62.1618889|-0.346955|0.1040195|52.7088123 unknown
InChI: InChI=1S/C5H11NO/c1-5-4-7-3-2-6-5/h5-6H,2-4H2,1H3
charge 0 multiplicity 1
18 atoms
O  1.191092 -1.202315 0.222817
N  -0.336532 1.189829 -0.17738
C  -1.008269 -0.02615 0.353072
C  -0.228844 -1.252418 -0.167953
C  1.085455 1.275272 0.231099
C  1.816086 0.02794 -0.295921
C  -2.474756 -0.06316 -0.105446
H  -0.966394 -0.058431 1.471618
H  -0.617117 -2.186851 0.271046
H  -0.314644 -1.288485 -1.276648
H  1.21676 1.319234 1.340186
H  1.539487 2.182897 -0.2089
H  -0.865261 2.046205 0.035642
H  1.78335 0.02408 -1.406849
H  2.862488 -0.005885 0.050036
H  -2.982964 -0.971054 0.26699
H  -3.032284 0.813384 0.276004
H  -2.530651 -0.050192 -1.208814
