program: Gaussian 09
title: 000292129
version: EM64L-G09RevD.01
frameworkgroup: C1[X(C12H13F3O2)]
method: RPBEPBE
basis: SDD
operation: Freq
keyword: #p
keyword: freq=noraman
keyword: PBEPBE/SDD
title: #p freq=noraman PBEPBE/SDD
converged: YES YES NO NO
title: Mulliken charges:
elementType: F F F O O C C C C C C C C C C C C H H H H H H H H H H H H H
charge: -0.165769 -0.166800 -0.166596 -0.301748 -0.267774 0.322208 0.046934 0.369829 -0.721311 -0.738246 -0.382235 -0.365728 -0.530584 -0.337814 -0.338957 0.287365 0.260536 0.221645 0.212840 0.267824 0.220043 0.229780 0.252908 0.291118 0.270762 0.234034 0.243657 0.224739 0.263745 0.263594
chargesum: 0.00000
title: Mulliken charges with hydrogens summed into heavy atoms:
elementType: F F F O O C C C C C C C C C C C C
charge: -0.165769 -0.166800 -0.166596 -0.301748 -0.267774 0.322208 0.046934 0.369829 -0.019002 -0.035515 -0.091117 -0.094966 0.171845 -0.074069 -0.075363 0.287365 0.260536
polarizability: 1.80746590e+02 4.02699993e+00 1.15945322e+02 -2.28449518e+00 1.05575728e+01 1.12622100e+02
1716.lowfreq: -3.3697 -0.0008 -0.0001 0.0007 4.5864 9.3300 14.5270 44.3423 57.1634
frequency: 13.9570 44.3282 57.1582 94.1939 98.5239 114.9134 120.2562 144.8894 167.1797 175.7055 196.3623 226.2876 241.1771 258.7654 324.4292 355.8004 364.6694 370.9162 405.8056 410.1036 430.2564 455.7896 480.6243 516.4691 538.1392 550.6300 588.1394 619.2240 630.7774 664.4726 734.4543 747.1892 835.2952 867.1788 869.8607 890.0584 918.4088 942.1324 977.7563 984.7411 986.3618 994.7738 1000.0386 1015.6072 1023.0320 1036.9060 1085.2104 1113.1322 1118.4220 1133.4741 1158.4348 1190.9963 1240.0687 1260.2656 1282.5742 1304.9628 1372.1140 1376.5819 1386.3197 1398.7732 1406.4175 1431.5702 1451.4693 1458.7672 1462.2489 1475.9701 1477.9626 1481.9511 1505.2351 1582.6645 1623.7425 2974.1318 2989.2709 2993.6172 3070.3762 3073.9458 3080.4632 3110.7116 3127.1293 3130.3616 3151.2245 3153.7274 3169.9421 3174.0319
redmass: 10.5765 5.2440 3.7454 2.9512 3.7961 1.0509 5.4240 2.8660 1.1472 1.5327 2.4560 5.6861 5.4553 4.6198 3.2149 8.2475 5.1954 2.8838 5.1162 3.2109 5.7362 6.1639 6.4317 9.4256 3.7879 6.5434 3.6148 8.1851 8.0127 6.4768 5.8925 4.9058 2.1577 1.4086 3.2008 2.5899 4.3307 1.4055 3.2471 1.9390 1.6034 4.1511 1.5441 3.6000 7.5169 2.1859 2.4444 1.6563 1.3779 1.4816 1.4269 1.1276 3.5438 3.7773 5.3591 1.2689 3.6972 5.6449 1.3181 1.2212 3.4497 1.1674 1.0494 1.0504 1.0512 1.0516 1.0808 1.1226 2.7194 7.5749 6.2939 1.0316 1.0378 1.0376 1.1033 1.0986 1.0980 1.0985 1.1021 1.0979 1.0884 1.0886 1.0965 1.0976
irintensity: 0.0617 0.4311 0.6271 5.5966 1.2563 0.2201 1.2838 1.1497 0.2220 2.3254 4.4620 0.3757 0.7814 2.6751 2.7942 2.8035 4.5280 2.0671 21.9099 3.1644 13.6494 9.6331 4.0484 0.5545 2.2460 6.9013 32.7833 3.9056 1.5826 9.0346 2.5629 0.3131 69.4881 8.1042 55.0856 30.2782 26.9309 4.0216 127.6506 57.8791 47.9769 128.5745 34.7196 4.5902 175.7644 61.5458 117.1899 12.8221 9.6473 24.5106 2.9253 0.4850 92.7247 15.5828 314.6237 0.6527 11.5687 8.1617 29.3226 18.4775 23.3452 5.0856 6.7913 0.2313 8.1612 13.4756 12.6652 9.7879 0.9481 0.9650 28.8870 49.1003 7.6996 37.6839 34.9466 1.2576 34.4109 18.6113 20.3619 7.5182 0.9273 0.3303 3.6773 0.4876
temp: 298.150 k
press: 1.00000 atm
elementType: 9 9 9 8 8 6 6 6 6 6 6 6 6 6 6 6 6 1 1 1 1 1 1 1 1 1 1 1 1 1
symmnumber: 1
zpe: 588933.5 jmol-1
zpe.correction: 0.224313 hartree
zpe.thermalcorrener: 0.241640 hartree
zpe.thermalcorrenthalpy: 0.242584 hartree
zpe.thermalcorrgfe: 0.177929 hartree
zpe.sumelectzpe: -913.743192 hartree
zpe.sumelectthermal: -913.725865 hartree
zpe.sumelectthermalent: -913.724921 hartree
zpe.sumelectthermalfe: -913.789576 hartree
dipole: -3.3270 0.1326 0.8697
dipole: 3.4413
quadrupole: -114.4483 -92.1574 -97.2208
quadrupole: 1.5497 -3.6544 -0.2007
quadrupole: -13.1728 9.1181 4.0547 1.5497 -3.6544 -0.2007
hfenergy: -913.9675047 hartree
pointgroup: C01 [X(C12H13F3O2)]
dipole: 1.3088499 -0.0332173 -0.3448074 debye
polarizability: 180.7224148|-4.6370297|110.9614488|-1.299451|-10.1467605|117.6301483 unknown
InChI: InChI=1S/C12H13F3O2/c1-10(2)11(16-3,17-10)8-4-6-9(7-5-8)12(13,14)15/h4-7H,1-3H3
charge 0 multiplicity 1
30 atoms
F  -4.181625 -1.04086 0.886147
F  -4.257014 1.15007 0.320422
F  -4.196514 -0.427388 -1.302384
O  2.846359 -0.087542 1.28876
O  2.663502 1.391681 -0.69685
C  3.098725 -0.94182 0.027732
C  2.162807 0.247894 -0.007459
C  0.658585 0.140273 0.00154
C  4.496331 -0.799921 -0.549505
C  2.556773 -2.357754 0.11671
C  -0.042646 -0.24914 1.168096
C  -0.065204 0.443108 -1.180664
C  2.376601 2.667702 -0.006658
C  -1.449039 -0.340426 1.156998
C  -1.469757 0.349092 -1.199751
C  -2.160905 -0.046025 -0.029126
C  -3.660666 -0.098031 -0.032781
H  5.217375 -1.356802 0.076054
H  4.530794 -1.221497 -1.571215
H  4.796865 0.256563 -0.597192
H  2.524668 -2.817153 -0.888499
H  3.220918 -2.973396 0.749744
H  1.542567 -2.387755 0.544549
H  0.528378 -0.467597 2.075738
H  0.479894 0.756571 -2.076611
H  2.831216 3.448561 -0.633969
H  2.837724 2.664913 0.997381
H  1.286855 2.840849 0.079093
H  -1.989863 -0.643919 2.058593
H  -2.026505 0.57085 -2.115393
