program: Gaussian 09
title: 000292127
version: EM64L-G09RevD.01
frameworkgroup: C1[X(C10H9ClF3NOS)]
method: RPBEPBE
basis: SDD
operation: Freq
keyword: #p
keyword: freq=noraman
keyword: PBEPBE/SDD
title: #p freq=noraman PBEPBE/SDD
converged: YES YES NO NO
title: Mulliken charges:
elementType: Cl S F F F O N C C C C C C C C C C H H H H H H H H H
charge: -0.040251 0.030852 -0.139902 -0.139935 -0.179755 -0.205358 -0.350813 -0.739195 -0.338466 0.609588 -0.406832 -0.363088 -0.197849 -0.217877 0.164281 -0.113985 0.321486 0.320752 0.286570 0.237559 0.358961 0.246322 0.234253 0.262418 0.260129 0.100134
chargesum: 0.00000
title: Mulliken charges with hydrogens summed into heavy atoms:
elementType: Cl S F F F O N C C C C C C C C C C
charge: -0.040251 0.130986 -0.139902 -0.139935 -0.179755 -0.205358 0.008148 -0.418443 0.185663 0.609588 -0.160510 -0.128835 0.064569 0.042252 0.164281 -0.113985 0.321486
polarizability: 1.64377617e+02 -3.45728191e+01 1.51536150e+02 -1.08836228e+01 -9.14798874e-01 1.19305301e+02
1716.lowfreq: -8.5495 -7.8235 -5.7158 0.0009 0.0011 0.0017 1.7445 20.7358 24.4064
frequency: -7.2861 20.6873 24.4003 26.8473 54.8196 72.9598 130.7147 147.4156 162.4309 173.1492 204.9901 246.3229 257.1003 296.5223 314.8420 330.0247 373.9417 378.0185 406.6399 424.2790 443.9491 487.1344 508.9796 521.9199 593.0244 626.9817 634.9587 646.7638 683.4701 710.8102 726.4036 760.4841 794.6056 827.8284 831.0248 874.7822 952.0222 967.5775 980.9011 995.4276 1001.0081 1022.0687 1039.1471 1061.1013 1076.1104 1117.6038 1134.3546 1187.2002 1210.9798 1224.5656 1229.8845 1252.1352 1295.0870 1331.7528 1350.3864 1381.8952 1401.4959 1456.7879 1478.7607 1498.4178 1584.1387 1598.9674 1655.6218 2429.5168 3026.0397 3056.4829 3106.2183 3123.1899 3138.0233 3169.2987 3174.4179 3532.5762
redmass: 9.6940 14.5137 8.6488 5.8634 7.6472 10.0343 5.1026 2.4598 9.8001 1.8384 6.7470 5.4351 10.1000 8.2651 3.7943 5.7800 13.4606 7.8445 2.8851 7.5946 10.6527 3.5261 3.2420 8.2807 3.1094 6.5768 7.1977 1.3803 4.1578 9.6384 2.7866 3.6737 3.4389 1.4392 1.3390 1.7266 1.3857 1.3813 3.1464 4.9812 4.1747 4.9958 12.4168 3.2657 2.7303 1.4316 6.6346 1.1155 2.0188 1.4548 1.1836 2.3945 1.2604 1.6103 1.2569 4.7968 2.3680 1.0946 2.4190 1.7897 7.1469 6.2693 9.8005 1.0383 1.0645 1.0845 1.1018 1.0893 1.0903 1.0950 1.0961 1.0780
irintensity: 3.6006 0.5966 0.6709 0.5561 0.9183 0.3812 5.1287 3.4399 0.8778 20.9133 3.6769 3.8574 5.0037 1.0570 1.5986 0.7013 0.9238 16.5495 0.1795 25.3233 7.2981 6.4593 15.7813 15.7616 24.9536 1.4816 14.3755 105.7888 29.8686 6.9989 27.2173 0.8634 51.8912 21.6911 3.8872 22.4687 2.2027 0.3528 53.6079 7.1715 102.1655 92.3834 240.8204 11.3540 49.7658 14.2157 227.0402 0.1833 4.2694 20.0453 0.1956 12.3487 1.4665 7.7276 6.4006 0.2693 8.6641 39.2509 68.5467 136.7797 0.6464 15.3176 282.2081 21.1206 14.9452 4.3466 0.9070 12.5443 5.6431 3.0290 1.0129 44.6142
temp: 298.150 k
press: 1.00000 atm
elementType: 17 16 9 9 9 8 7 6 6 6 6 6 6 6 6 6 6 1 1 1 1 1 1 1 1 1
symmnumber: 1
zpe: 454344.0 jmol-1
zpe.correction: 0.173051 hartree
zpe.thermalcorrener: 0.189439 hartree
zpe.thermalcorrenthalpy: 0.190383 hartree
zpe.thermalcorrgfe: 0.125537 hartree
zpe.sumelectzpe: -1672.831103 hartree
zpe.sumelectthermal: -1672.814714 hartree
zpe.sumelectthermalent: -1672.813770 hartree
zpe.sumelectthermalfe: -1672.878616 hartree
dipole: 3.3371 0.7835 -2.3696
dipole: 4.1672
quadrupole: -138.0625 -123.0036 -102.6967
quadrupole: 1.7054 3.0121 -5.2478
quadrupole: -16.8082 -1.7494 18.5576 1.7054 3.0121 -5.2478
hfenergy: -1673.0041532 hartree
pointgroup: C01 [X(C10H9Cl1F3N1O1S1)]
dipole: 1.34524 -0.1211728 0.9293011 debye
dipolederiv: -0.4986759 -0.4187504 0.0225553 -0.4303396 -0.4718431 0.0227797 0.017829 0.0167119 -0.1173679 -0.2756976 0.0948973 0.1154891 -0.0291715 -0.3777211 0.1284423 0.1865658 0.2281624 -0.0058274 -0.7750043 0.0990242 0.2268661 0.188655 -0.3574714 -0.0291517 0.222638 0.0070252 -0.3881778 -0.3414461 0.0827073 -0.0770472 0.1364011 -0.3853531 0.1680656 -0.1014645 0.1281835 -0.7382815 -0.5520452 -0.1313545 -0.1283615 -0.1216943 -0.6828102 -0.1432799 -0.1422027 -0.1103829 -0.3607349 -0.8383996 0.0049771 -0.16929 -0.3985715 -0.5802039 -0.1786442 -0.3113772 -0.0302233 -0.4002193 -1.2363599 0.1571227 -0.1485031 0.3079255 -0.466695 0.0361887 -0.2195497 -0.0387153 -0.5330513 0.3804548 -0.0612247 -0.0121307 0.0116681 0.5136233 0.0024061 -0.022432 -0.1730858 0.0544813 0.2822012 -0.1991375 -0.028356 -0.426846 0.2104385 -0.0760793 -0.0380317 0.0486804 0.2273893 -0.1092442 0.0918089 -0.0072725 0.1810694 0.0761095 -0.0167792 0.0066212 -0.0211134 -0.083302 -0.0793238 0.0410808 0.0506653 0.0512122 -0.0906583 0.0607169 -0.0099634 0.009456 0.0760811 -0.0983142 0.0620534 0.0050362 0.0758764 -0.1074054 -0.0281734 0.004737 0.0050042 0.0375331 -0.2158642 -0.1214055 -0.0509474 -0.1319356 -0.1850162 -0.055716 -0.0601849 -0.0742646 0.0237635 -0.2038035 -0.118439 0.056365 -0.0993982 -0.2063436 0.0480685 0.1018258 0.0995541 0.0064883 1.4153751 -0.0056593 0.494677 0.3239983 0.5991663 0.1712049 0.7408659 0.0566544 0.3730543 0.6510952 0.6812533 -0.0261474 0.7040975 0.6000046 -0.0268789 -0.0292375 -0.0453467 0.1045452 1.632015 -0.0181785 -0.050356 -0.1724902 1.2429162 -0.0098476 -0.0364699 -0.0221361 1.4964656 0.0335351 -0.0012848 -0.0144335 0.0052408 0.0269622 0.0260057 -0.0342842 -0.0141815 -0.0311607 0.0216252 -0.0818891 0.024127 0.0040278 0.0447309 0.0133335 0.0035928 -0.0176505 0.1062342 0.0379908 0.0669192 -0.1080021 0.1012168 0.0544272 -0.0211245 -0.0686644 -0.006161 -0.0634781 0.3114884 -0.0139031 -0.0898002 -0.0098216 0.1696183 0.0200493 -0.0966192 0.0055966 0.2850699 0.0754524 -0.0587704 -0.0697286 -0.0662313 0.0758957 -0.0632299 -0.0518197 -0.0481162 -0.0021166 0.0984345 -0.0504757 0.0661958 -0.063007 0.070289 0.0765465 0.0912675 0.0653654 -0.0359189 0.1058481 -0.0528642 0.0424383 -0.0568942 0.108969 0.0470654 0.0418796 0.0434987 0.0034988 0.1020038 -0.0572672 -0.0440363 -0.058698 0.1058423 -0.0412668 -0.0467069 -0.042619 0.0067276 0.0766594 0.0087597 -0.0800026 -0.02629 0.0125281 -0.1307017 -0.1488146 -0.0698965 -0.0416958 unknown
polarizability: 159.686639|35.9857715|156.0359471|6.762329|-4.3727624|119.4964825 unknown
InChI: InChI=1S/C10H9ClF3NOS/c11-7-3-1-6(2-4-7)8(17)5-15-9(16)10(12,13)14/h1-4,8,15,17H,5H2
charge 0 multiplicity 1
26 atoms
Cl 4.768985 2.384864 -0.236399
S  1.08531 -3.677847 0.212656
F  -4.419696 1.288363 0.581044
F  -3.372554 1.470916 -1.420334
F  -2.303459 2.112498 0.479913
O  -3.299315 -1.285145 -0.38303
N  -1.444824 -0.387694 0.747662
C  0.360146 -1.919993 -0.068457
C  -0.765518 -1.676959 0.968144
C  1.44351 -0.856627 -0.095405
C  1.9280 -0.366304 -1.334844
C  1.997677 -0.329771 1.102258
C  2.938648 0.618075 -1.389001
C  3.009394 0.65427 1.068972
C  -2.642221 -0.317343 0.080554
C  3.46597 1.114882 -0.181557
C  -3.187148 1.133091 -0.071152
H  -0.096731 -2.017841 -1.068243
H  -1.518113 -2.476329 0.875109
H  -0.366873 -1.700657 1.997887
H  -0.979609 0.477667 1.034866
H  1.516018 -0.759755 -2.271132
H  1.655542 -0.691703 2.079737
H  3.305731 0.991477 -2.349074
H  3.434347 1.053448 1.994423
H  1.831686 -3.332984 1.328801
