program: Gaussian 09
title: 000292097
version: EM64L-G09RevD.01
frameworkgroup: C1[X(C8H11NO)]
method: RPBEPBE
basis: SDD
operation: Freq
keyword: #p
keyword: freq=noraman
keyword: PBEPBE/SDD
title: #p freq=noraman PBEPBE/SDD
converged: YES YES NO NO
title: Mulliken charges:
elementType: O N C C C C C C C C H H H H H H H H H H H
charge: -0.441158 -0.706141 0.316783 0.330343 -0.613804 -0.385728 0.519634 -0.477317 -0.436436 -0.830906 0.221013 0.225515 0.197760 0.215525 0.215605 0.223459 0.219882 0.262381 0.303360 0.303468 0.336762
chargesum: 0.00000
title: Mulliken charges with hydrogens summed into heavy atoms:
elementType: O N C C C C C C C C
charge: -0.104395 -0.099313 0.316783 0.330343 -0.392792 -0.160214 0.519634 -0.064032 -0.220831 -0.125183
polarizability: 1.32109512e+02 6.92801573e+00 1.05024148e+02 -5.14566312e+00 4.04750068e+00 5.57634468e+01
1716.lowfreq: -7.6574 -0.0010 -0.0009 -0.0008 6.6638 14.5700 81.6722 122.6267 138.7015
frequency: 81.6508 122.6163 138.6947 152.1736 268.6422 285.5153 307.0905 327.5237 334.2916 356.1761 367.3763 434.1038 458.8300 473.6257 554.5661 642.4022 714.5495 739.3102 750.2760 815.8840 860.5267 908.4909 936.6938 941.5642 972.7305 1000.2175 1044.8059 1047.1658 1125.1869 1152.6260 1179.9450 1226.0080 1277.7462 1297.5687 1330.1549 1370.0263 1383.3299 1400.5194 1442.6957 1467.6699 1474.2032 1492.1573 1511.0708 1584.9130 1633.6992 1644.1300 2965.6117 2968.4830 3047.7626 3067.4336 3085.5271 3098.4395 3110.3171 3135.1925 3555.6653 3569.9457 3710.5570
redmass: 3.7637 3.2764 1.0988 3.6070 2.1049 2.8213 2.3637 1.4257 1.8128 1.0766 1.8970 3.3425 2.7362 4.0357 3.6229 4.1517 3.2730 4.1031 3.8758 1.4116 1.7545 4.5101 1.6240 1.7860 1.8731 1.6199 1.4354 1.4866 1.8816 1.1280 1.6450 1.9456 1.5037 1.2831 2.8442 1.2023 5.4030 1.2275 3.1979 1.0916 1.1154 1.1016 3.3138 6.2537 1.9829 1.9523 1.0410 1.0682 1.0920 1.0952 1.1000 1.0906 1.0867 1.0966 1.0663 1.0448 1.1040
irintensity: 1.4388 1.4028 1.7815 4.8768 15.0256 6.3293 39.5524 134.7628 198.3411 26.4557 79.7225 0.2192 5.9025 3.0507 13.0528 4.7575 0.9178 2.1792 12.7619 35.3043 55.5053 45.9805 8.8740 27.1623 1.9028 3.9311 2.7216 12.0193 2.8770 24.6556 16.8431 5.0142 4.2905 26.5613 42.7596 33.2092 7.1283 8.6254 23.6957 7.4057 14.8553 10.3324 101.2007 12.3723 0.2098 267.0348 48.1768 72.1233 23.4661 21.4632 9.8594 25.1975 19.2179 28.0412 5.5918 61.1888 19.1342
temp: 298.150 k
press: 1.00000 atm
elementType: 8 7 6 6 6 6 6 6 6 6 1 1 1 1 1 1 1 1 1 1 1
symmnumber: 1
zpe: 456651.0 jmol-1
zpe.correction: 0.173929 hartree
zpe.thermalcorrener: 0.184293 hartree
zpe.thermalcorrenthalpy: 0.185238 hartree
zpe.thermalcorrgfe: 0.138865 hartree
zpe.sumelectzpe: -440.670910 hartree
zpe.sumelectthermal: -440.660546 hartree
zpe.sumelectthermalent: -440.659601 hartree
zpe.sumelectthermalfe: -440.705974 hartree
dipole: -3.5986 -0.8243 0.0106
dipole: 3.6918
quadrupole: -56.1153 -53.0713 -61.8199
quadrupole: 5.4639 -2.7773 0.5966
quadrupole: 0.8868 3.9309 -4.8177 5.4639 -2.7773 0.5966
hfenergy: -440.8448391 hartree
pointgroup: C01 [X(C8H11N1O1)]
dipole: 1.3936213 -0.4087452 -0.0211338 debye
dipolederiv: -0.5984238 -0.268674 -0.206973 -0.3171111 -0.5853156 0.0456827 -0.3245789 0.0086524 -0.5148543 -1.2234836 0.6006669 -0.0584626 0.6437483 -0.4799929 -0.15304 -0.0525716 -0.1511378 -0.7238226 -0.0104677 -0.1844127 -0.0287925 0.0325705 0.144087 -0.0426994 0.0366086 0.02249 -0.1118173 0.017178 -0.2243084 0.0169312 -0.1928036 -0.155958 0.0576483 -0.0244317 0.1008542 -0.0959583 -0.3843826 0.3425951 -0.0530546 -0.1650214 0.0040563 -0.0428795 0.0224525 -0.1303088 -0.233571 0.1670438 0.1630963 -0.0769479 -0.0762405 0.1167329 -0.0354579 -0.019511 -0.0785661 -0.1243123 1.2348265 -0.7232485 -0.003377 -0.7593365 0.3509082 0.0664608 0.0050021 0.0645028 0.144455 0.4975642 0.1228099 0.1238132 0.1813717 0.4412961 -0.0279866 0.1459222 -0.0292661 0.5286251 -0.1678613 -0.0093815 -0.0214184 0.4724409 -0.1622683 -0.0909692 -0.1064265 -0.0168013 -0.2188647 -0.0979259 0.0554202 -0.0191423 0.0312831 0.0273011 -0.0211839 0.0263385 -0.062786 0.0764329 0.0642946 0.0105116 0.0146572 0.0276229 -0.1347374 0.057439 0.0103217 0.0628182 0.1440881 0.0838259 0.0208481 0.0023226 -0.0034567 -0.1331509 0.0528558 0.0038924 0.0544727 0.1319345 0.0065069 0.0865799 -0.0934135 0.0004175 -0.1643174 0.1272524 -0.0468169 0.0609115 -0.0228644 -0.0595647 0.0043775 0.0850458 0.0568172 0.0436798 -0.103959 0.0344176 -0.0575263 -0.0322818 -0.1199638 -0.0779971 0.0583184 -0.0641448 0.04518 0.0348887 0.0563214 0.0401498 0.1535208 -0.0024627 0.0727038 0.065323 0.067217 0.0628417 -0.0055249 0.1214798 -0.0598371 -0.1232702 0.0738773 -0.0713845 0.0377148 0.0362716 -0.1303169 0.0865377 -0.0037092 0.1083775 0.0640826 -0.0443979 0.0017482 -0.053744 -0.0540555 0.0943543 -0.0523497 -0.0803314 -0.0156359 0.0565943 0.1727518 -0.0342651 0.0390934 -0.049017 0.1569091 0.0550791 0.0382493 0.0558009 0.3698182 0.1965748 -0.0278276 0.032819 -0.0191318 0.1308218 0.0548907 0.0262364 0.0577667 0.3737218 0.1944902 0.1401419 0.1392871 0.1505582 0.327889 -0.0626851 0.1311347 -0.0349314 0.1583435 unknown
polarizability: 130.7842506|-9.0919674|105.2091274|-7.1921733|-6.8547187|56.9037288 unknown
InChI: InChI=1S/C8H11NO/c1-6-2-3-8(9)4-7(6)5-10/h2-4,10H,5,9H2,1H3
charge 0 multiplicity 1
21 atoms
O  -2.864465 -1.254678 -0.507979
N  2.970085 -1.154044 -0.040078
C  -0.681194 -0.372731 0.342956
C  -0.711635 1.029008 0.070333
C  0.540361 -1.083904 0.306423
C  0.51612 1.660132 -0.24586
C  1.769172 -0.437647 -0.008231
C  -1.956904 -1.133117 0.660634
C  1.737767 0.956651 -0.287881
C  -2.00684 1.82199 0.129116
H  0.539457 -2.160587 0.527002
H  0.517562 2.735734 -0.462525
H  -1.714075 -2.140376 1.058188
H  -2.573078 -0.604593 1.407255
H  2.667057 1.484305 -0.536798
H  -2.344435 1.974704 1.174026
H  -1.87845 2.820944 -0.323189
H  -2.821366 1.297954 -0.40103
H  2.990399 -2.147783 0.166609
H  3.846246 -0.689255 -0.256944
H  -2.330386 -1.583709 -1.275525
