program: Gaussian 09
title: 000292118
version: EM64L-G09RevD.01
frameworkgroup: C1[X(C9H11N5O5)]
method: RPBEPBE
basis: SDD
operation: Freq
keyword: #p
keyword: freq=noraman
keyword: PBEPBE/SDD
title: #p freq=noraman PBEPBE/SDD
converged: YES YES NO NO
title: Mulliken charges:
elementType: O O O O O N N N N N C C C C C C C C C H H H H H H H H H H H
charge: -0.264630 -0.449560 -0.482880 -0.499055 -0.253836 -0.164255 -0.067341 -0.372924 -0.072720 -0.005870 -0.157078 -0.120409 -0.146525 -0.007717 -0.393229 0.109810 -0.172576 0.069832 0.084819 0.263074 0.297008 0.273823 0.252006 0.239380 0.233742 0.359712 0.389032 0.328889 0.377037 0.352442
chargesum: 0.00000
title: Mulliken charges with hydrogens summed into heavy atoms:
elementType: O O O O O N N N N N C C C C C C C C C
charge: -0.264630 -0.089848 -0.093849 -0.122017 -0.253836 -0.164255 -0.067341 -0.020482 -0.072720 -0.005870 0.105996 0.176600 0.127298 0.244289 0.079892 0.109810 0.156313 0.069832 0.084819
polarizability: 1.92891028e+02 -2.85769769e+00 1.52976452e+02 -1.91742801e+00 1.13497015e+01 9.25430277e+01
1716.lowfreq: -17.3314 -2.3290 0.0007 0.0007 0.0009 4.4547 22.2166 39.7754 64.6423
frequency: 21.8949 39.7608 64.4863 88.7823 113.9078 118.8503 126.6058 175.6328 188.8363 223.7573 248.2433 265.0018 291.6591 307.1247 326.2710 335.9148 356.0004 394.5503 437.9072 456.4701 481.5090 517.7900 530.2427 568.8818 589.6423 636.2165 643.6597 661.7938 675.9968 691.3514 717.8067 729.7267 757.0235 796.0134 813.7641 852.7390 887.3409 898.0577 898.8210 925.7071 929.3025 946.2965 969.5077 1002.6122 1008.0967 1031.9063 1059.3685 1084.4283 1104.7422 1146.5544 1159.6719 1184.2110 1193.1620 1211.5920 1220.1318 1224.3237 1265.5398 1273.2152 1284.4304 1304.1543 1309.1455 1318.3396 1334.5876 1353.8729 1377.7394 1386.2304 1418.5848 1428.2225 1436.4173 1477.1825 1487.5800 1538.0514 1632.0609 2999.8604 3024.1727 3026.0972 3028.1882 3053.9661 3071.0154 3211.6691 3391.9618 3569.4840 3574.5798 3603.0696
redmass: 6.8508 5.7241 9.3618 3.2971 7.9552 5.9914 6.8551 7.2794 6.7207 5.7168 6.4581 5.3459 4.9112 1.3225 1.4026 2.8012 6.9951 4.6256 5.6714 6.0127 8.9689 10.1280 8.8479 3.8540 11.8031 4.6647 9.0396 1.4352 4.2674 1.6027 2.1155 4.6343 9.8687 6.4580 4.3422 6.5446 3.6962 2.4788 2.3013 4.6932 5.0174 3.6261 3.1655 4.0602 2.9169 4.4232 2.5230 4.5425 1.9724 2.0053 1.5018 1.1999 1.9361 1.2151 3.4207 1.2235 3.2357 1.3116 1.2257 1.4423 1.7211 2.2753 1.3987 1.4342 2.2958 1.8754 1.5778 1.7647 2.2337 1.0767 3.5369 11.4701 10.6249 1.0563 1.0877 1.0866 1.0874 1.0889 1.1079 1.1026 1.0648 1.0666 1.0808 1.0670
irintensity: 0.9307 2.3170 0.7364 9.4673 8.2723 3.4923 3.0099 3.7934 6.0971 6.0913 9.6552 20.0762 1.2209 112.7495 147.2921 57.6597 8.1274 13.9332 0.9737 9.1385 6.3618 0.1597 0.7849 2.5428 2.8788 23.4889 25.0012 86.3027 11.6294 84.4521 75.6168 32.0201 0.8979 43.7488 55.2114 12.9832 44.5192 7.6520 17.8112 61.3799 30.2616 21.6171 103.3403 76.9636 12.1740 181.3149 5.6970 11.1649 22.3562 43.7871 59.2905 51.9181 66.5652 59.6091 86.9430 13.7276 25.4100 2.4856 15.2092 0.8718 24.9598 17.3635 22.3606 44.1969 40.4860 10.4058 12.7866 57.6901 35.5620 9.8983 33.0702 0.8865 345.5749 32.7827 7.1158 4.8187 31.7060 21.6692 54.9880 69.3725 156.1787 15.6745 110.8047 14.7045
temp: 298.150 k
press: 1.00000 atm
elementType: 8 8 8 8 8 7 7 7 7 7 6 6 6 6 6 6 6 6 6 1 1 1 1 1 1 1 1 1 1 1
symmnumber: 1
zpe: 571283.0 jmol-1
zpe.correction: 0.217590 hartree
zpe.thermalcorrener: 0.234253 hartree
zpe.thermalcorrenthalpy: 0.235197 hartree
zpe.thermalcorrgfe: 0.172369 hartree
zpe.sumelectzpe: -997.926478 hartree
zpe.sumelectthermal: -997.909815 hartree
zpe.sumelectthermalent: -997.908871 hartree
zpe.sumelectthermalfe: -997.971699 hartree
dipole: 6.4224 -4.1507 -0.2350
dipole: 7.6505
quadrupole: -108.3991 -112.6834 -109.5283
quadrupole: 5.7280 16.9758 -10.4284
quadrupole: 1.8045 -2.4798 0.6753 5.7280 16.9758 -10.4284
hfenergy: -998.1440679 hartree
pointgroup: C01 [X(C9H11N5O5)]
dipole: -2.5270898 1.5897421 -0.3825752 debye
polarizability: 192.4919241|-1.394637|149.9266116|6.9956973|-17.4200304|95.9919721 unknown
InChI: InChI=1S/C9H11N5O5/c15-1-3-5(16)6(17)9(19-3)14-2-10-7-4(14)8(18)12-13-11-7/h2-3,5-6,9,11,15-17H,1H2
charge 0 multiplicity 1
30 atoms
O  -1.595616 -0.322508 1.186546
O  -1.978437 -2.652267 -0.968386
O  -2.777007 0.852106 -1.498478
O  -4.781959 1.237408 0.251556
O  2.095667 -2.178957 0.955492
N  0.323329 0.178093 -0.180949
N  1.287043 2.160012 -0.8127
N  3.596516 1.489546 -0.130941
N  3.923679 -0.666629 0.772509
N  4.439581 0.488449 0.420001
C  -1.599883 -1.242666 -1.061026
C  -0.698137 -0.841318 0.148098
C  -2.908213 -0.456619 -0.852848
C  -3.00198 -0.348376 0.690561
C  -3.67628 0.938273 1.19532
C  1.69114 0.060242 0.109862
C  0.135106 1.446169 -0.730473
C  2.2449 1.295426 -0.289653
C  2.49093 -1.019665 0.634722
H  -1.12672 -0.99914 -2.030795
H  -0.137833 -1.704702 0.552944
H  -3.758752 -1.02116 -1.272635
H  -3.493711 -1.254806 1.088349
H  -2.931547 1.756157 1.190097
H  -4.066119 0.801242 2.220009
H  -1.175034 -3.226406 -1.047285
H  -3.622452 1.338245 -1.27202
H  -0.848134 1.774325 -1.065846
H  -5.397061 1.905533 0.640373
H  4.082685 2.349795 -0.388004
