program: Gaussian 09
title: 000292109
version: EM64L-G09RevD.01
frameworkgroup: C1[X(C18H11NO2)]
method: RPBEPBE
basis: SDD
operation: Freq
keyword: #p
keyword: freq=noraman
keyword: PBEPBE/SDD
title: #p freq=noraman PBEPBE/SDD
converged: YES YES NO NO
title: Mulliken charges:
elementType: O O N C C C C C C C C C C C C C C C C C C H H H H H H H H H H H
charge: -0.447828 -0.256665 0.008967 0.432358 0.251236 0.172589 0.275579 0.215391 0.067452 -0.634627 -0.082945 -0.565512 -0.371040 -0.396369 -0.333655 -0.303603 -0.262254 -0.253397 0.095523 -0.258587 -0.236283 0.279303 0.247078 0.229760 0.311230 0.227443 0.265416 0.233672 0.234865 0.230792 0.235155 0.388956
chargesum: 0.00000
title: Mulliken charges with hydrogens summed into heavy atoms:
elementType: O O N C C C C C C C C C C C C C C C C C C
charge: -0.058872 -0.256665 0.008967 0.432358 0.251236 0.172589 0.275579 0.215391 0.067452 -0.355323 -0.082945 -0.318435 -0.141280 -0.085139 -0.106213 -0.038187 -0.028582 -0.018532 0.095523 -0.027794 -0.001129
polarizability: 3.77583379e+02 2.33762157e+01 2.44967123e+02 4.57000206e-02 -3.54256348e-02 7.72605147e+01
1716.lowfreq: -6.6458 -3.3561 -0.0006 0.0002 0.0006 5.6638 39.0780 41.3301 69.6756
frequency: 39.0334 41.3241 69.6749 101.6197 140.2106 145.5396 183.5299 225.1570 256.6897 279.6740 316.1503 322.4281 370.2160 395.4266 408.6688 436.2166 476.7293 488.9850 521.4491 532.7190 555.6921 561.6388 574.8090 580.7517 602.7160 614.7577 649.7411 680.5259 694.4741 727.5162 736.8668 773.3161 775.7014 780.9801 798.3483 826.3946 858.1937 881.7151 885.6470 902.5986 932.3556 933.7207 955.7621 967.7187 978.3316 997.5732 1013.3438 1018.6255 1033.7855 1051.5752 1066.0288 1099.9113 1144.5391 1173.5148 1181.0860 1188.9142 1213.5525 1238.2302 1258.8226 1274.8783 1303.8821 1314.5149 1352.8900 1378.0508 1387.8800 1397.3686 1405.5116 1431.9026 1436.5216 1449.5291 1469.8356 1507.2077 1519.8814 1561.9750 1568.9557 1598.5955 1615.7872 1622.1015 1631.5866 3131.4339 3132.2493 3136.0970 3146.0455 3153.3619 3159.5266 3172.2363 3173.8016 3188.8425 3192.7054 3531.1124
redmass: 10.4542 5.7661 4.8973 4.0916 6.3510 4.2921 4.7571 5.7993 3.9690 6.8210 6.3510 9.7922 8.4827 3.2329 5.7287 2.9272 3.5333 5.7836 7.6494 2.5232 3.2968 8.2228 5.2545 2.1755 7.4027 1.8335 5.6154 6.5921 3.7463 3.7508 5.8098 1.4034 6.0089 1.5277 3.4331 1.8042 5.5702 5.9478 1.7411 1.6078 1.7267 7.9243 1.9651 1.3848 1.3731 1.3347 1.3252 4.8213 2.2235 2.4602 2.4525 2.6098 1.6569 1.1783 1.5455 1.2274 2.2725 2.1867 1.9041 1.8238 1.7779 2.2125 5.2883 2.2247 4.6209 3.7426 3.2309 3.6481 2.3409 2.8014 2.7590 4.2704 4.0005 6.6785 7.1283 6.8121 6.1291 6.0358 8.1177 1.0883 1.0855 1.0888 1.0897 1.0920 1.0955 1.0953 1.0997 1.0953 1.0902 1.0641
irintensity: 2.2329 0.4368 0.0910 0.3515 0.0263 0.0834 0.0002 3.0639 1.5323 0.5949 1.9084 1.2384 1.3683 1.3819 6.1461 19.3889 0.2378 2.3488 0.7420 13.7818 4.8114 0.3929 38.5956 42.1242 21.7230 102.5094 15.3434 4.6344 0.2520 4.4151 3.9322 34.1277 1.0149 132.7444 7.0196 7.0344 3.9850 5.0382 1.7072 0.0921 14.6767 105.9779 5.3692 6.2894 4.0814 0.0642 1.4989 1.8197 9.8709 9.7260 273.1282 28.9405 13.6004 7.9278 4.8750 3.5978 6.6145 21.2798 6.5054 5.7109 49.7813 39.8607 5.5809 23.0373 4.5865 7.5261 1.1707 5.3137 1.3900 4.3645 23.0137 25.2768 13.7049 10.3330 3.9311 13.4515 0.8034 26.5120 303.4525 12.9034 0.8474 3.3717 9.8979 20.0089 20.2264 22.8793 27.4428 18.0917 0.2574 60.1379
temp: 298.150 k
press: 1.00000 atm
elementType: 8 8 7 6 6 6 6 6 6 6 6 6 6 6 6 6 6 6 6 6 6 1 1 1 1 1 1 1 1 1 1 1
symmnumber: 1
zpe: 628084.2 jmol-1
zpe.correction: 0.239225 hartree
zpe.thermalcorrener: 0.254468 hartree
zpe.thermalcorrenthalpy: 0.255412 hartree
zpe.thermalcorrgfe: 0.196139 hartree
zpe.sumelectzpe: -896.357252 hartree
zpe.sumelectthermal: -896.342009 hartree
zpe.sumelectthermalent: -896.341065 hartree
zpe.sumelectthermalfe: -896.400337 hartree
dipole: 0.5149 1.2418 0.0040
dipole: 1.3444
quadrupole: -112.5639 -104.5484 -126.0510
quadrupole: 13.2136 -0.0287 -0.0034
quadrupole: 1.8239 9.8393 -11.6632 13.2136 -0.0287 -0.0034
hfenergy: -896.5964764 hartree
pointgroup: C01 [X(C18H11N1O2)]
dipole: -0.2016245 -0.4883832 -0.0241884 debye
polarizability: 377.4892783|23.5887097|244.5973993|1.6013543|8.8059433|77.7243394 unknown
InChI: InChI=1S/C18H11NO2/c20-18(21)15-9-14-13-7-3-4-8-17(13)19-10-16(14)12-6-2-1-5-11(12)15/h1-10,20H
charge 0 multiplicity 1
32 atoms
O  1.586045 -3.62248 -0.2187
O  3.647196 -2.58928 -0.171642
N  -2.337061 2.14111 0.071226
C  -0.669201 -0.201184 -0.049101
C  -0.094781 1.106727 0.02032
C  1.35501 1.269255 0.031006
C  2.216633 0.104086 -0.029611
C  -2.122068 -0.338033 -0.058644
C  1.591461 -1.212929 -0.098771
C  0.200742 -1.334554 -0.106662
C  -2.913107 0.867239 0.003748
C  -1.004583 2.230929 0.077755
C  1.962641 2.56362 0.100794
C  3.637135 0.291707 -0.01862
C  -2.807442 -1.589373 -0.125738
C  -4.337799 0.79414 -0.001592
C  3.352058 2.718681 0.110592
C  4.19353 1.573355 0.05009
C  2.395731 -2.468903 -0.162959
C  -4.20765 -1.642875 -0.129926
C  -4.981702 -0.44622 -0.067387
H  -0.216818 -2.340927 -0.159153
H  -0.612207 3.251237 0.131447
H  1.337327 3.45866 0.148324
H  4.281675 -0.587448 -0.065181
H  -2.243953 -2.526225 -0.175309
H  -4.890909 1.736886 0.047501
H  3.790646 3.72085 0.164805
H  5.282316 1.692993 0.057246
H  -4.712912 -2.613545 -0.182006
H  -6.075405 -0.502308 -0.071269
H  2.187351 -4.413693 -0.259986
