program: Gaussian 09
title: 000292100
version: EM64L-G09RevD.01
frameworkgroup: C1[X(C13H18)]
method: RPBEPBE
basis: SDD
operation: Freq
keyword: #p
keyword: freq=noraman
keyword: PBEPBE/SDD
title: #p freq=noraman PBEPBE/SDD
converged: YES YES NO NO
title: Mulliken charges:
elementType: C C C C C C C C C C C C C H H H H H H H H H H H H H H H H H H
charge: -0.202580 0.006933 -0.478337 -0.445264 -0.412194 -0.408022 0.530660 -0.749365 -0.397256 -0.475218 -0.250350 -0.222050 -0.248938 0.199079 0.195125 0.190458 0.214423 0.197851 0.216028 0.197506 0.183829 0.194211 0.199560 0.215348 0.213602 0.207725 0.226840 0.231351 0.220892 0.222169 0.225984
chargesum: 0.00000
title: Mulliken charges with hydrogens summed into heavy atoms:
elementType: C C C C C C C C C C C C C
charge: -0.003501 0.202058 -0.073456 -0.031384 -0.030859 -0.014251 0.530660 -0.112691 -0.170416 -0.243867 -0.029458 0.000119 -0.022954
polarizability: 1.75131992e+02 5.17519508e+00 1.02903334e+02 1.21903646e+00 -7.50992863e+00 1.22265022e+02
1716.lowfreq: -8.0761 -0.0009 -0.0005 -0.0004 8.9256 14.7306 38.3914 83.2003 89.1436
frequency: 37.0926 83.1237 89.1227 149.8161 201.8330 220.6973 245.8390 265.1139 296.6522 327.0677 401.2734 405.6956 427.6491 473.0899 505.8711 535.1218 614.2334 618.1986 706.7511 765.6744 767.4779 800.5198 846.2499 851.9641 863.4508 877.9006 893.7165 920.7505 939.4199 973.0929 977.2001 978.8042 990.4640 991.7678 1027.0431 1050.1527 1070.3730 1073.9240 1091.6891 1103.0773 1142.1224 1158.9538 1170.5722 1187.9779 1208.2090 1209.7736 1255.1737 1257.1441 1266.8789 1289.3414 1304.8095 1318.6551 1327.4764 1333.7115 1340.5079 1349.6027 1358.5949 1383.2334 1384.7856 1441.2325 1454.4755 1461.0077 1465.4370 1471.8782 1474.2901 1476.7688 1482.9422 1591.2073 1612.6261 2939.9939 2951.5014 2956.6220 2961.9257 2964.1426 2966.1278 2972.2909 3018.7214 3025.3782 3027.4879 3039.5607 3060.0365 3064.7892 3112.1721 3116.1099 3130.5711 3140.8000 3159.9317
redmass: 3.5252 3.3319 3.1356 2.3084 1.1118 2.2446 2.9997 3.9908 2.1596 2.7059 3.5153 2.8113 1.7424 2.8917 2.0664 2.8648 5.0306 5.8548 1.6472 2.0529 1.8993 3.3557 1.4192 1.2490 1.6438 2.3410 1.9395 1.5520 1.8297 1.4047 1.6626 1.5256 5.5520 1.3365 2.1947 1.7380 1.1607 1.6072 2.3001 2.6446 2.1061 2.1006 1.0558 1.1119 1.4181 2.1034 1.5327 1.3218 1.2491 1.3620 1.2657 1.3010 1.3337 1.4211 1.4996 1.5615 1.5758 1.9720 2.0206 2.1344 1.0904 1.0920 1.0877 1.0890 1.0856 1.0613 2.1245 5.9505 6.1575 1.0802 1.0732 1.0669 1.0599 1.0622 1.0413 1.0637 1.0978 1.1007 1.0986 1.1029 1.0990 1.0993 1.0864 1.0860 1.0909 1.0959 1.1014
irintensity: 0.0476 0.0948 0.1904 0.0247 0.0730 0.2392 0.4845 0.0722 0.0219 0.0906 0.1052 0.0086 0.3813 0.3051 1.6281 14.0695 2.0757 0.9321 55.3360 39.5260 4.8269 1.8397 2.7535 0.0386 4.6184 1.0328 0.6015 0.9314 7.6581 0.5018 5.3824 3.4175 0.0189 0.1684 8.6118 1.3765 1.1320 9.6511 2.6703 0.1784 6.1921 0.4781 0.0564 0.0671 1.2053 1.3401 1.3683 2.1043 2.3644 1.5055 0.1229 1.4700 1.2999 1.7796 2.3395 1.8289 2.5539 6.5012 4.6854 7.2348 1.5337 6.8562 11.4158 2.7112 18.2526 6.2082 24.2332 1.7531 12.3318 7.3667 13.2829 18.6139 23.2633 50.7441 66.4727 36.6485 65.5278 32.7891 33.8996 71.0177 73.5797 45.3504 9.7790 5.6316 14.1422 50.6606 25.8589
temp: 298.150 k
press: 1.00000 atm
elementType: 6 6 6 6 6 6 6 6 6 6 6 6 6 1 1 1 1 1 1 1 1 1 1 1 1 1 1 1 1 1 1
symmnumber: 1
zpe: 719233.8 jmol-1
zpe.correction: 0.273942 hartree
zpe.thermalcorrener: 0.285954 hartree
zpe.thermalcorrenthalpy: 0.286898 hartree
zpe.thermalcorrgfe: 0.235664 hartree
zpe.sumelectzpe: -505.207498 hartree
zpe.sumelectthermal: -505.195485 hartree
zpe.sumelectthermalent: -505.194541 hartree
zpe.sumelectthermalfe: -505.245776 hartree
dipole: 0.5625 0.1386 -0.0886
dipole: 0.5860
quadrupole: -76.9178 -83.3646 -75.3058
quadrupole: 1.3926 0.0185 -1.9912
quadrupole: 1.6116 -4.8352 3.2236 1.3926 0.0185 -1.9912
hfenergy: -505.4814395 hartree
pointgroup: C01 [X(C13H18)]
dipole: 0.221695 0.0599506 -0.0203065 debye
polarizability: 175.2071234|4.1759725|107.7762844|2.2932275|-11.323835|117.3169393 unknown
InChI: InChI=1S/C13H18/c1-11-6-5-9-13(10-11)12-7-3-2-4-8-12/h2-4,7-8,11,13H,5-6,9-10H2,1H3
charge 0 multiplicity 1
31 atoms
C  0.412619 0.463225 -0.316067
C  2.779477 -0.538635 -0.568916
C  1.271164 -0.833599 -0.368264
C  0.948467 1.410843 0.796263
C  3.290093 0.420387 0.536249
C  2.451723 1.718523 0.60323
C  -1.075456 0.16134 -0.149454
C  3.602788 -1.844057 -0.612477
C  -1.558796 -0.547141 0.983642
C  -2.015963 0.582745 -1.123977
C  -2.934643 -0.825371 1.135415
C  -3.395318 0.307271 -0.977789
C  -3.860796 -0.399415 0.154071
H  0.546916 0.988209 -1.286256
H  2.895611 -0.018789 -1.545931
H  1.141028 -1.397142 0.579688
H  0.901185 -1.49049 -1.18011
H  0.795142 0.933393 1.785967
H  0.358453 2.347694 0.800985
H  4.357221 0.662294 0.360656
H  3.237075 -0.102116 1.515294
H  2.589492 2.290557 -0.3380
H  2.81283 2.366473 1.425665
H  3.25321 -2.51499 -1.419562
H  4.6760 -1.636685 -0.78363
H  3.51423 -2.393622 0.344817
H  -0.854331 -0.88686 1.752815
H  -1.662075 1.131269 -2.00627
H  -3.286441 -1.374669 2.01657
H  -4.103435 0.642005 -1.744757
H  -4.928668 -0.616345 0.270635
