program: Gaussian 09
title: 000292165
version: EM64L-G09RevD.01
frameworkgroup: C1[X(C18H22N2O5)]
method: RPBEPBE
basis: SDD
operation: Freq
keyword: #p
keyword: freq=noraman
keyword: PBEPBE/SDD
title: #p freq=noraman PBEPBE/SDD
converged: YES YES NO NO
title: Mulliken charges:
elementType: O O O O O N N C C C C C C C C C C C C C C C C C C H H H H H H H H H H H H H H H H H H H H H H
charge: -0.247132 -0.256169 -0.253098 -0.223711 -0.258701 -0.364294 -0.412997 -0.313096 0.127194 0.402223 -0.732068 0.079273 -0.471976 0.263704 0.235662 0.218826 -0.399894 -0.356372 -0.276936 -0.031770 -0.213817 -0.257069 -0.265602 -0.666051 -0.661628 0.280367 0.222986 0.238974 0.221399 0.290662 0.327217 0.308102 0.279213 0.228819 0.224492 0.166257 0.223263 0.223046 0.233421 0.220481 0.235038 0.254108 0.238044 0.211954 0.281416 0.221630 0.204609
chargesum: 0.00000
title: Mulliken charges with hydrogens summed into heavy atoms:
elementType: O O O O O N N C C C C C C C C C C C C C C C C C C
charge: -0.247132 -0.256169 -0.253098 -0.223711 -0.258701 -0.037077 -0.104895 -0.032729 0.127194 0.402223 -0.048709 0.079273 -0.181314 0.263704 0.235662 0.218826 -0.120681 -0.127553 -0.052444 0.134487 0.009446 0.199398 0.189917 0.038056 0.046028
polarizability: 2.74561148e+02 1.63074457e+01 2.22991255e+02 9.49780122e+00 -2.00880723e+01 1.74586157e+02
1716.lowfreq: -8.9889 -6.8844 -0.0009 -0.0005 -0.0002 1.4981 17.9653 25.3485 29.7464
frequency: 17.8722 25.1046 29.5687 35.4862 45.6783 61.3953 76.4457 94.1533 102.6305 125.4296 132.8306 136.6883 151.2071 163.5594 178.9813 187.8792 193.7537 201.9220 216.0309 224.4199 239.1032 265.5360 291.3477 308.7825 315.4489 322.5694 355.4631 386.2681 387.2369 427.3887 429.4535 438.8039 474.4137 485.1452 522.8812 549.1996 553.3050 574.7635 607.6594 636.4101 653.8171 658.0878 686.1008 722.7661 725.1120 741.2644 755.1032 758.7623 767.9964 772.7416 802.7053 816.7178 818.3664 822.2826 848.0809 858.5674 868.3149 942.7482 945.7588 961.1031 963.3782 981.8543 988.7200 1001.4813 1014.1186 1018.0219 1024.3391 1063.2610 1085.1771 1095.5629 1098.4247 1099.6676 1119.4155 1135.4117 1143.2839 1157.4018 1158.6200 1170.7187 1175.2378 1221.1207 1241.6636 1246.4338 1272.3651 1274.1003 1291.3267 1302.7320 1319.7554 1347.9329 1350.2630 1358.1206 1366.7862 1388.4576 1389.6841 1397.2249 1401.1029 1420.0869 1452.0697 1456.0348 1456.7992 1458.3233 1459.9421 1460.2351 1470.7526 1479.4645 1483.3900 1483.8625 1485.5935 1538.1487 1582.2089 1618.7626 1630.3287 1631.3405 1640.4894 2941.2699 2994.0469 2994.1848 2999.8191 3029.0456 3029.5619 3030.3192 3087.5853 3090.5590 3093.4444 3096.4136 3099.3114 3108.8928 3122.1027 3122.9778 3126.2720 3138.0237 3154.6159 3167.2508 3216.3885 3447.4079 3609.4821
redmass: 4.9765 4.6033 2.9552 3.7518 3.0579 3.9599 4.6855 4.6051 4.2850 5.0957 5.7793 3.3567 2.9915 2.7884 4.3158 3.9505 2.9022 1.6923 1.9018 3.6471 1.2423 3.8344 2.9080 4.3704 3.1712 2.9666 7.6535 4.2833 4.3671 3.1896 3.5052 3.3955 4.2362 6.3409 1.3439 4.1872 6.1028 2.8005 3.9311 3.3870 9.2304 1.4061 2.7314 4.0029 4.7576 3.1685 1.3408 4.5221 4.1492 3.7185 2.0269 1.4574 1.5683 1.6866 3.9220 1.4460 5.0180 1.3654 3.9113 2.1003 1.9610 1.3016 2.5252 2.8872 2.2483 2.9060 3.7885 1.9888 3.1765 2.1793 2.1486 1.8184 2.3028 2.2261 2.2608 1.7374 1.6771 1.1424 4.6310 2.5417 2.3875 1.8051 1.1290 1.1248 2.1694 1.6956 1.3383 1.2724 1.2839 1.6925 1.2435 4.1318 1.2321 1.2201 1.2077 2.5536 1.6374 1.2538 2.2676 1.1112 1.0935 1.0691 1.0539 1.0625 1.0578 2.9573 1.0528 4.9690 6.0436 9.6255 6.8503 7.8676 6.9582 1.0866 1.0365 1.0362 1.0367 1.0842 1.0594 1.0598 1.0984 1.0976 1.1003 1.1028 1.1039 1.0988 1.1059 1.1043 1.0854 1.0902 1.0952 1.0994 1.0975 1.0783 1.0809
irintensity: 0.9966 0.8963 0.4103 0.9497 1.4984 1.9764 0.4813 4.1262 0.2842 2.4026 5.9996 1.5776 1.0451 3.8315 0.5847 1.6329 9.2906 6.1138 4.4435 4.6455 0.7266 4.6108 4.5375 7.9822 12.2247 7.8856 7.7811 12.6950 7.1641 14.3566 3.8593 8.1879 4.6222 16.5897 86.7480 11.4507 3.6056 13.3440 1.4610 10.3444 19.9771 45.4242 16.3818 9.3273 1.5730 2.3510 116.6234 10.6950 3.4656 8.9799 3.7384 21.9803 4.2587 2.0743 1.9709 2.7478 1.4837 6.2137 17.1535 5.2238 1.3898 1.5607 15.8074 35.0455 19.3673 54.5288 32.3422 8.8463 132.9676 56.9314 23.0090 13.7074 54.6796 177.0900 139.2601 20.2819 18.6711 3.7189 188.1571 36.0943 26.0906 6.2354 5.4123 4.1670 3.1499 3.4932 1.0393 2.7877 0.8831 27.2130 10.0262 37.4785 22.5801 29.0832 16.3664 3.3316 248.8429 34.7934 6.9174 35.2419 22.5740 9.2225 7.3260 26.8391 23.7209 2.4956 15.5965 9.5424 2.7746 127.0566 23.9995 232.0679 152.2349 113.2139 6.5260 39.0779 19.3159 0.5921 42.3030 20.0386 42.3773 26.1003 25.3861 0.8547 5.4535 25.3285 25.7119 21.1874 0.1909 19.1267 18.0695 21.4205 0.1632 196.6077 66.5396
temp: 298.150 k
press: 1.00000 atm
elementType: 8 8 8 8 8 7 7 6 6 6 6 6 6 6 6 6 6 6 6 6 6 6 6 6 6 1 1 1 1 1 1 1 1 1 1 1 1 1 1 1 1 1 1 1 1 1 1
symmnumber: 1
zpe: 983740.6 jmol-1
zpe.correction: 0.374687 hartree
zpe.thermalcorrener: 0.400047 hartree
zpe.thermalcorrenthalpy: 0.400992 hartree
zpe.thermalcorrgfe: 0.317688 hartree
zpe.sumelectzpe: -1182.892804 hartree
zpe.sumelectthermal: -1182.867444 hartree
zpe.sumelectthermalent: -1182.866500 hartree
zpe.sumelectthermalfe: -1182.949803 hartree
dipole: 3.7851 -0.0745 1.5141
dipole: 4.0774
quadrupole: -134.1762 -134.6310 -145.0711
quadrupole: -13.8930 18.9521 -3.4251
quadrupole: 3.7833 3.3284 -7.1117 -13.8930 18.9521 -3.4251
hfenergy: -1183.2674915 hartree
pointgroup: C01 [X(C18H22N2O5)]
dipole: 1.5071061 -0.2817654 0.4717582 debye
polarizability: 278.6483563|-0.9960198|208.9030616|-8.3178933|-28.3762751|184.5871428 unknown
InChI: InChI=1S/C18H22N2O5/c1-4-24-16(22)18(20-11-21,17(23)25-5-2)12(3)14-10-19-15-9-7-6-8-13(14)15/h6-12,19-20H,4-5H2,1-3H3
charge 0 multiplicity 1
47 atoms
O  -0.26295 1.758434 0.84731
O  -2.946364 0.359756 -0.679097
O  -0.225735 1.111618 -1.385843
O  -3.151697 -1.626037 0.522639
O  -2.547223 0.467857 2.578318
N  -0.688639 -0.713424 1.776133
N  3.137141 -2.525164 1.229423
C  -0.102697 -1.650501 -0.475843
C  -0.922363 -0.534976 0.339801
C  1.321487 -1.772276 0.048581
C  -0.805277 -3.02909 -0.510965
C  2.50557 -1.040428 -0.391225
C  1.757717 -2.667912 1.034963
C  -0.444239 0.855833 -0.179328
C  -2.462525 -0.675806 0.098327
C  3.625429 -1.536098 0.367784
C  2.739233 -0.039583 -1.375441
C  4.943084 -1.059382 0.186806
C  4.050989 0.433012 -1.565639
C  -1.482082 -0.181667 2.768285
C  5.141197 -0.065872 -0.791503
C  0.08623 3.160345 0.450072
C  -4.435429 0.428132 -0.8462
C  -1.183123 3.939024 0.096094
C  -5.044938 1.231854 0.304977
H  -0.058336 -1.253614 -1.506445
H  -1.043011 -3.401805 0.500538
H  -1.754254 -2.989813 -1.067952
H  -0.138966 -3.754534 -1.00992
H  1.198515 -3.43568 1.567431
H  0.20637 -1.151287 2.024215
H  3.69935 -3.073224 1.876682
H  1.91132 0.357686 -1.970484
H  5.781905 -1.447439 0.775475
H  4.24311 1.200163 -2.323844
H  -1.083181 -0.402446 3.784056
H  6.149286 0.327106 -0.964716
H  0.587654 3.561104 1.34497
H  0.791021 3.117487 -0.398894
H  -4.564221 0.919266 -1.823932
H  -4.829406 -0.60277 -0.8791
H  -1.665699 3.510081 -0.797753
H  -1.899999 3.915623 0.934373
H  -0.925081 4.993005 -0.11745
H  -4.827308 0.752927 1.273179
H  -4.634619 2.256017 0.329223
H  -6.141149 1.294993 0.171424
