program: Gaussian 09
title: 000292110
version: EM64L-G09RevD.01
frameworkgroup: C1[X(C18H12N2O)]
method: RPBEPBE
basis: SDD
operation: Freq
keyword: #p
keyword: freq=noraman
keyword: PBEPBE/SDD
title: #p freq=noraman PBEPBE/SDD
converged: YES YES NO NO
title: Mulliken charges:
elementType: O N N C C C C C C C C C C C C C C C C C C H H H H H H H H H H H H
charge: -0.255804 0.003846 -0.624591 0.382851 0.258851 0.157089 0.274096 0.226194 0.164820 -0.694753 -0.085342 -0.566350 -0.365018 -0.438696 -0.336344 -0.262351 -0.305996 -0.256323 0.086208 -0.260429 -0.235125 0.265702 0.244166 0.231419 0.285808 0.230878 0.234824 0.263938 0.234316 0.231033 0.233903 0.339693 0.337488
chargesum: 0.00000
title: Mulliken charges with hydrogens summed into heavy atoms:
elementType: O N N C C C C C C C C C C C C C C C C C C
charge: -0.255804 0.003846 0.052590 0.382851 0.258851 0.157089 0.274096 0.226194 0.164820 -0.429051 -0.085342 -0.322184 -0.133599 -0.152888 -0.105465 -0.027527 -0.042058 -0.022006 0.086208 -0.029396 -0.001223
polarizability: 3.72185342e+02 -2.76275538e+01 2.41471323e+02 1.18213482e+00 -5.43547665e+00 8.74368960e+01
1716.lowfreq: -6.4145 -0.0006 -0.0005 0.0006 1.4326 7.0490 43.4065 61.1967 73.0224
frequency: 43.4051 61.1873 73.0181 103.5192 139.0630 143.2721 180.9060 208.4792 254.2525 275.3751 294.5281 313.8625 363.7920 405.9951 421.6925 439.9676 474.8740 487.4304 501.0317 522.9372 541.5933 557.1797 561.7021 567.1647 588.3071 604.7707 635.4861 644.2902 676.8990 697.3709 724.4158 755.5147 773.7026 775.5699 782.0811 802.3849 830.5227 856.2486 881.6359 886.6672 902.8964 931.2801 951.7343 968.3661 975.1275 976.3956 997.8471 1003.2564 1018.8420 1033.9044 1050.4945 1059.6792 1095.8200 1141.4540 1173.3571 1180.8518 1187.0267 1216.9223 1244.8239 1254.9701 1270.8684 1305.7126 1318.3751 1366.9267 1376.5114 1388.7288 1398.7943 1403.8952 1432.6228 1436.2264 1449.4661 1469.5170 1510.3127 1518.7897 1563.2354 1569.0605 1575.3762 1604.7670 1615.6341 1622.7137 1628.5646 3127.1553 3132.7899 3134.0697 3145.8551 3149.4784 3159.3812 3164.4542 3168.1509 3173.6605 3173.9674 3509.1307 3665.1334
redmass: 5.7000 4.9592 6.1204 4.4054 5.3093 4.3111 4.6869 4.9349 4.4132 6.5252 5.0963 7.4461 4.4083 4.7192 3.9528 2.9869 3.4954 4.9726 3.5067 3.2340 1.4498 4.8241 3.8860 4.0062 2.9836 1.9904 3.9947 3.4008 5.9834 3.7191 4.4042 4.4412 2.3702 2.2143 1.5133 3.3608 1.7168 5.5238 5.8633 1.7146 1.5742 1.5907 2.5627 1.3881 1.8011 2.6871 1.3332 1.3520 4.5405 2.2582 2.1684 1.8865 2.8275 1.6865 1.1804 1.6504 1.1664 2.5592 1.9281 2.0209 1.8202 2.0953 2.8390 5.4857 2.2685 3.9038 2.8271 4.6997 3.6892 2.3935 2.8439 2.7949 4.2564 3.8976 6.7763 6.7362 2.7162 2.8821 6.0238 5.8247 2.7063 1.0897 1.0855 1.0863 1.0898 1.0897 1.0953 1.0940 1.0908 1.0992 1.0987 1.0447 1.1046
irintensity: 4.7542 3.4108 2.0667 2.7546 0.5910 2.3459 0.1262 0.3199 5.6244 0.7818 2.3459 1.0021 4.2497 1.3282 3.2775 21.9897 1.8900 3.9100 3.3924 11.9572 142.9796 17.9233 9.4605 8.3930 3.7309 78.7849 7.6341 6.5548 3.4418 0.0783 1.7152 6.2676 21.9922 12.3419 120.8717 9.4795 2.5082 3.4571 3.7415 0.4648 0.3343 22.0209 3.6700 4.4161 1.1197 3.2022 0.1074 0.4007 0.8703 11.0920 4.5562 0.3795 0.6529 5.5691 2.4392 12.3460 2.7730 2.0808 14.1424 21.5993 1.7238 36.8984 100.0469 41.7153 28.6491 1.6897 52.7889 9.8377 5.5733 6.2565 8.1511 8.6707 13.5787 3.5027 21.0331 18.6202 120.2325 60.7858 4.5516 11.7801 166.2238 13.3419 1.0648 1.6542 9.7980 7.5787 15.8380 16.9706 5.7117 49.9176 7.0194 44.4019 33.7206
temp: 298.150 k
press: 1.00000 atm
elementType: 8 7 7 6 6 6 6 6 6 6 6 6 6 6 6 6 6 6 6 6 6 1 1 1 1 1 1 1 1 1 1 1 1
symmnumber: 1
zpe: 662411.0 jmol-1
zpe.correction: 0.252299 hartree
zpe.thermalcorrener: 0.267745 hartree
zpe.thermalcorrenthalpy: 0.268689 hartree
zpe.thermalcorrgfe: 0.209510 hartree
zpe.sumelectzpe: -876.488292 hartree
zpe.sumelectthermal: -876.472846 hartree
zpe.sumelectthermalent: -876.471902 hartree
zpe.sumelectthermalfe: -876.531081 hartree
dipole: 2.8270 -0.7592 2.2639
dipole: 3.7005
quadrupole: -93.2501 -122.4786 -125.8874
quadrupole: -9.9669 7.7490 7.9357
quadrupole: 20.6219 -8.6065 -12.0154 -9.9669 7.7490 7.9357
hfenergy: -876.740591 hartree
pointgroup: C01 [X(C18H12N2O1)]
dipole: 1.0883877 0.2675848 -0.9291796 debye
polarizability: 373.6769246|22.2097092|239.6042637|-12.0634506|-3.9198588|87.8123727 unknown
InChI: InChI=1S/C18H12N2O/c19-18(21)15-9-14-13-7-3-4-8-17(13)20-10-16(14)12-6-2-1-5-11(12)15/h1-10H,19H2
charge 0 multiplicity 1
33 atoms
O  1.793585 -3.664834 0.446908
N  -2.364946 2.162654 -0.094659
N  3.231811 -2.711624 -1.09851
C  -0.767184 -0.234121 -0.011261
C  -0.156683 1.057673 -0.079781
C  1.297018 1.178256 -0.08515
C  2.116096 -0.016812 -0.072929
C  -2.221985 -0.322746 0.040114
C  1.456885 -1.313023 -0.095137
C  0.070831 -1.397809 -0.024046
C  -2.976558 0.906732 -0.003585
C  -1.030812 2.209564 -0.126824
C  1.953091 2.450584 -0.070142
C  3.540873 0.119989 0.018921
C  -2.942324 -1.553174 0.135825
C  3.346987 2.555154 -0.018846
C  -4.402339 0.875721 0.043713
C  4.147738 1.379789 0.043786
C  2.177665 -2.64221 -0.198312
C  -4.342244 -1.564428 0.182975
C  -5.080688 -0.344362 0.135586
H  -0.367213 -2.399008 0.005588
H  -0.605911 3.216359 -0.198578
H  1.360619 3.369236 -0.082309
H  4.159989 -0.776402 0.114102
H  -2.403797 -2.504711 0.181157
H  3.821569 3.542043 -0.004266
H  -4.928827 1.834174 0.006657
H  5.236723 1.462684 0.126626
H  -4.875029 -2.518564 0.259466
H  -6.175083 -0.36708 0.172943
H  3.476654 -1.933895 -1.709808
H  3.690587 -3.614006 -1.225921
