program: Gaussian 09
title: 000292095
version: EM64L-G09RevD.01
frameworkgroup: C1[X(C4Cl10O)]
method: RPBEPBE
basis: SDD
operation: Freq
keyword: #pfreq=noraman
keyword: PBEPBE/SDD
title: #p freq=noraman PBEPBE/SDD
converged: NO YES NO NO
title: Mulliken charges:
elementType: Cl Cl Cl Cl Cl Cl Cl Cl Cl Cl O C C C C
charge: 0.152882 0.143818 0.152882 0.143817 0.172295 0.166429 0.165555 0.172294 0.165555 0.166429 -0.043713 -0.209263 -0.209262 -0.569859 -0.569860
chargesum: 0.00000
title: Mulliken charges with hydrogens summed into heavy atoms:
polarizability: 1.38413312e+02 -3.01006998e-05 1.31428422e+02 7.94293559e+00 1.64924129e-04 1.53205228e+02
1716.lowfreq: -13.8290 -7.0374 -3.9628 -0.0027 -0.0022 -0.0021 29.5343 39.6773 54.0179
frequency: 29.5320 39.6755 54.0179 72.7702 85.4709 139.3410 148.6360 151.9932 153.8896 176.6617 186.0354 187.0300 206.2980 207.6652 223.5871 246.4034 263.7953 273.4743 299.3153 305.5922 313.7868 330.4881 362.5649 376.4786 403.2447 490.8343 512.2586 647.5071 668.5396 707.1124 709.7359 749.6011 754.2973 765.8022 768.7955 901.2553 953.7912 1035.8627 1039.4053
redmass: 34.1756 32.6703 33.0225 33.2008 30.9895 30.6356 32.6306 34.5790 34.2791 33.6135 34.4294 34.1129 34.6961 34.8467 31.5655 31.1396 29.8116 30.2729 31.3034 31.2269 32.4503 32.0129 28.6593 32.7077 19.9690 16.1544 18.4081 13.5523 13.2907 13.2765 13.4230 12.7607 12.3391 12.4136 12.2818 12.4781 12.6101 13.6460 12.0427
irintensity: 0.0008 0.0652 0.0057 0.0111 0.1216 0.3022 0.0038 0.2252 1.2022 0.0067 0.8469 0.0282 0.5926 0.0078 0.0228 0.0019 0.9224 0.0098 0.2408 0.0030 0.1101 3.6636 0.4311 0.4430 3.8241 89.6356 4.8311 29.0734 48.2131 168.8606 418.2985 38.8099 12.6174 46.6379 2.2171 34.8849 234.1749 674.2994 0.7806
temp: 298.150 k
press: 1.00000 atm
elementType: 17 17 17 17 17 17 17 17 17 17 8 6 6 6 6
symmnumber: 1
zpe: 95357.6 jmol-1
zpe.correction: 0.036320 hartree
zpe.thermalcorrener: 0.054708 hartree
zpe.thermalcorrenthalpy: 0.055653 hartree
zpe.thermalcorrgfe: -0.012523 hartree
zpe.sumelectzpe: -4827.009856 hartree
zpe.sumelectthermal: -4826.991467 hartree
zpe.sumelectthermalent: -4826.990523 hartree
zpe.sumelectthermalfe: -4827.058699 hartree
dipole: 0.0000 -0.3375 0.0000
dipole: 0.3375
quadrupole: -154.8243 -153.7544 -151.9335
quadrupole: 0.0000 0.1400 0.0000
quadrupole: -1.3202 -0.2503 1.5706 0.0000 0.1400 0.0000
hfenergy: -4827.0461759 hartree
pointgroup: C01 [X(C4Cl10O1)]
dipole: 0.0000038 -0.1327856 -0.0000041 debye
dipolederiv: -0.1895807 0.0125316 0.0393886 0.161365 -0.4522653 -0.245417 0.1037391 -0.2253009 -0.2672855 -0.199129 -0.0360833 -0.042571 0.0599743 -0.1387961 0.1473793 -0.2025208 0.0871316 -0.6450829 -0.189581 -0.0125372 0.0393891 -0.1613809 -0.4523251 0.2453918 0.1037202 0.2252773 -0.2672264 -0.1991292 0.0360886 -0.0425653 -0.0599487 -0.1387667 -0.1473175 -0.2025256 -0.0870669 -0.6451141 -0.1423579 0.0383366 0.0468102 0.1003915 -0.4907249 -0.2689631 0.0965689 -0.233399 -0.270484 -0.6397633 0.1984091 -0.0843036 0.1759344 -0.1831183 0.0334833 -0.0760214 0.035803 -0.1027877 -0.1495038 -0.0105614 -0.0616839 -0.0027211 -0.1491839 0.1415825 -0.1070165 0.1094642 -0.6220471 -0.1423669 -0.038363 0.0468146 -0.100431 -0.4908024 0.2689224 0.0965661 0.2333569 -0.2703943 -0.1494961 0.0105777 -0.0616605 0.0027461 -0.1491443 -0.1415039 -0.1069882 -0.1093878 -0.6220985 -0.6397625 -0.1983879 -0.0843569 -0.1759119 -0.1831001 -0.0335026 -0.0760741 -0.0358244 -0.1028063 -2.4675185 0.0000267 -0.4085139 0.0000111 -0.5578159 -0.0000019 -0.1662789 -0.0000022 -0.5274642 1.5609697 -0.0422875 0.2260013 -0.489519 0.8344844 -0.0047766 0.1553748 0.1009794 1.1615463 1.5609691 0.0422605 0.2260036 0.4895035 0.8344973 0.0047351 0.1554312 -0.1010151 1.1615332 0.9931244 -0.190733 0.0806101 -0.3393288 0.8585208 0.0839973 0.1129945 0.0898455 1.0098656 0.9931255 0.1907223 0.0806376 0.3393153 0.8585404 -0.0840091 0.1130306 -0.0898616 1.0098459 unknown
polarizability: 138.8501905|-0.0005545|131.4284219|8.3283629|-0.0011776|152.7683494 unknown
InChI: InChI=1S/C4Cl10O/c5-1(6,7)3(11,12)15-4(13,14)2(8,9)10
charge 0 multiplicity 1
15 atoms
Cl 1.532118 -2.080411 -0.817513
Cl 1.48563 -0.99762 2.002613
Cl -1.532148 -2.08051 0.817268
Cl -1.485654 -0.99737 -2.002722
Cl 2.060545 2.085485 0.812959
Cl 4.037229 -0.062224 0.063855
Cl 2.09819 0.993936 -1.993862
Cl -2.060498 2.085629 -0.81261
Cl -2.098291 0.993613 1.994026
Cl -4.037254 -0.062169 -0.063957
O  -0.000013 0.078424 0.000013
C  1.26299 -0.539806 0.19877
C  -1.263016 -0.539779 -0.198821
C  2.320085 0.561361 -0.205362
C  -2.320111 0.561339 0.205444
