program: Gaussian 09
title: 000292099
version: EM64L-G09RevD.01
frameworkgroup: C1[X(C15H17NO2)]
method: RPBEPBE
basis: SDD
operation: Freq
keyword: #p
keyword: freq=noraman
keyword: PBEPBE/SDD
title: #p freq=noraman PBEPBE/SDD
converged: YES YES NO NO
title: Mulliken charges:
elementType: O O N C C C C C C C C C C C C C C C H H H H H H H H H H H H H H H H H
charge: -0.454148 -0.450338 -0.597823 -0.267677 -0.195398 0.450645 -0.303246 -0.461826 -0.391382 0.350915 -0.394368 -0.397300 0.342146 -0.396763 -0.394716 -0.234956 -0.234719 -0.240554 0.193212 0.264281 0.160723 0.228212 0.233685 0.260218 0.240816 0.240406 0.309891 0.268310 0.346906 0.237831 0.239327 0.362970 0.226641 0.227061 0.231018
chargesum: 0.00000
title: Mulliken charges with hydrogens summed into heavy atoms:
elementType: O O N C C C C C C C C C C C C C C C
charge: -0.107241 -0.087368 -0.019622 -0.074465 0.068883 0.450645 0.085688 -0.228140 -0.131164 0.350915 -0.153552 -0.156895 0.342146 -0.158932 -0.155389 -0.008316 -0.007658 -0.009536
polarizability: 2.91102373e+02 -1.57985672e+01 1.43982237e+02 1.20052249e+01 2.46379699e+01 1.23294464e+02
1716.lowfreq: -6.7263 -0.0004 -0.0001 0.0005 2.9841 12.1043 29.8965 33.7697 64.3184
frequency: 29.8061 33.7591 64.1271 75.7792 87.5866 99.4030 114.4229 173.7133 188.9817 234.4153 252.5939 288.4101 304.6807 318.9236 335.1514 386.5639 392.7217 404.8102 411.9296 413.5788 467.6243 507.5447 563.8440 584.5744 614.2396 621.1286 637.7537 674.9286 702.0233 726.8196 740.5904 771.9540 795.6420 832.7871 844.8501 851.1392 851.8024 882.8397 920.4083 943.1340 962.1833 974.1884 976.0561 987.4711 989.1013 994.7972 995.7235 1005.6538 1018.0876 1040.8507 1043.6320 1085.9308 1114.2332 1125.5606 1142.3249 1174.0702 1175.6176 1189.0710 1196.7155 1214.4874 1247.2231 1274.7672 1283.3873 1291.0814 1305.6236 1307.1085 1322.6496 1337.2942 1369.3803 1376.5536 1377.2097 1406.8800 1412.9376 1439.1088 1476.3883 1481.3113 1515.0862 1567.4188 1588.7195 1612.7899 1619.8626 1648.7207 2898.4037 2925.1821 3025.9936 3072.6639 3116.0202 3123.2377 3126.7907 3129.5845 3140.4413 3146.0786 3149.5682 3152.9841 3165.5845 3318.2547 3416.3052 3547.5411 3565.2803
redmass: 4.6688 5.5319 3.4787 3.7094 4.7530 4.8294 3.2215 5.1194 5.2511 4.7255 4.3052 1.5166 1.8043 1.2446 3.7546 4.3268 4.7027 2.8581 2.8760 2.7324 4.4242 3.7037 3.0039 2.6042 6.3912 5.7247 6.6566 1.1299 1.7519 5.1799 2.9786 2.0112 1.5867 3.9459 1.5562 1.2771 1.3179 2.1209 1.4458 3.2516 1.4276 1.4289 1.4309 1.9416 3.9042 1.3376 6.0900 5.0189 2.7073 1.9445 2.5527 1.6220 1.8259 1.6456 1.3521 1.0537 1.1899 1.1287 1.2722 1.6653 1.4161 1.3209 1.6173 2.8910 1.3413 1.3781 1.3015 1.4863 2.3832 6.4798 1.3772 1.2372 3.4910 2.3805 2.1676 1.0913 2.8612 5.9276 6.4527 6.0162 6.3073 1.0889 1.0721 1.0831 1.0849 1.0915 1.0881 1.0846 1.0874 1.0871 1.0920 1.0951 1.0960 1.0965 1.1016 1.0638 1.0480 1.0929 1.0661
irintensity: 1.3365 1.3038 1.4140 0.2294 2.9793 0.6206 8.0950 5.5023 0.4165 6.0385 7.3108 13.2682 4.6567 149.7972 23.9752 6.5491 6.1934 1.8201 2.2044 5.0746 2.6770 15.1409 15.5530 30.2253 0.6873 0.9268 1.3750 132.7101 46.6454 2.3573 20.1141 93.5747 267.0452 46.1837 24.3292 3.3849 2.6482 10.1702 2.4833 63.8873 6.1183 0.6883 1.4806 25.1682 4.2095 0.3453 18.0771 101.8762 6.4814 0.9193 50.3293 8.4856 14.9025 15.9060 14.7160 0.1590 28.7420 0.1589 1.4088 1.2634 24.4291 26.0734 16.9155 0.2573 29.4964 11.7406 0.9917 5.8508 4.0904 0.4660 2.6715 81.2895 8.1884 3.0941 43.5495 1.6449 5.2733 2.4187 1.0741 4.8399 3.0653 50.7178 62.9614 71.2627 18.2335 42.8515 18.9205 7.8388 2.7891 6.7367 13.7114 9.1439 48.3637 2.4282 26.4997 58.7185 3.9465 8.2373 6.3544
temp: 298.150 k
press: 1.00000 atm
elementType: 8 8 7 6 6 6 6 6 6 6 6 6 6 6 6 6 6 6 1 1 1 1 1 1 1 1 1 1 1 1 1 1 1 1 1
symmnumber: 1
zpe: 752655.4 jmol-1
zpe.correction: 0.286671 hartree
zpe.thermalcorrener: 0.303413 hartree
zpe.thermalcorrenthalpy: 0.304357 hartree
zpe.thermalcorrgfe: 0.241217 hartree
zpe.sumelectzpe: -785.670487 hartree
zpe.sumelectthermal: -785.653746 hartree
zpe.sumelectthermalent: -785.652802 hartree
zpe.sumelectthermalfe: -785.715941 hartree
dipole: -1.9260 -2.8980 2.6997
dipole: 4.4041
quadrupole: -101.0588 -110.7678 -105.0501
quadrupole: -13.0506 12.5604 9.6818
quadrupole: 4.5668 -5.1422 0.5755 -13.0506 12.5604 9.6818
hfenergy: -785.9571585 hartree
pointgroup: C01 [X(C15H17N1O2)]
dipole: -0.7553477 -1.3486312 0.7828929 debye
polarizability: 291.1400309|-18.1306324|132.2016452|7.4093022|26.7616675|135.0373973 unknown
InChI: InChI=1S/C15H17NO2/c16-14(10-17)15(18)13-8-6-12(7-9-13)11-4-2-1-3-5-11/h1-9,14-15,17-18H,10,16H2
charge 0 multiplicity 1
35 atoms
O  3.438553 -2.171756 -0.09898
O  4.54178 2.505348 -0.620299
N  5.313357 -0.065863 -0.313941
C  3.024745 -0.859679 0.453849
C  3.848951 0.172505 -0.361426
C  1.522824 -0.653523 0.351338
C  3.612413 1.635491 0.090674
C  0.777098 -0.16315 1.451305
C  0.837297 -0.929344 -0.86092
C  -1.304121 -0.208411 0.130376
C  -0.611269 0.057372 1.343072
C  -0.549244 -0.709315 -0.967927
C  -2.772032 0.02607 0.014751
C  -3.58407 -0.806241 -0.804764
C  -3.400371 1.090789 0.718933
C  -4.972874 -0.582979 -0.916918
C  -4.789222 1.314588 0.608904
C  -5.583738 0.478944 -0.210206
H  3.331913 -0.792866 1.522967
H  3.548538 0.082264 -1.42255
H  3.758291 1.717333 1.194502
H  2.589259 1.967182 -0.150066
H  1.284041 0.039455 2.403161
H  1.399938 -1.315018 -1.718498
H  -1.170055 0.407401 2.218074
H  -1.050162 -0.897517 -1.924266
H  5.583058 -0.907865 -0.835223
H  5.67232 -0.118652 0.650497
H  2.854662 -2.87357 0.285645
H  -3.130627 -1.652146 -1.333906
H  -2.79282 1.767997 1.330227
H  5.34713 1.920967 -0.76725
H  -5.579556 -1.242175 -1.547964
H  -5.249656 2.146812 1.153136
H  -6.661854 0.653153 -0.297006
