program: Gaussian 09
title: 000292092
version: EM64L-G09RevD.01
frameworkgroup: C1[X(C10H11NO4)]
method: RPBEPBE
basis: SDD
operation: Freq
keyword: #p
keyword: freq=noraman
keyword: PBEPBE/SDD
title: #p freq=noraman PBEPBE/SDD
converged: YES YES NO NO
title: Mulliken charges:
elementType: O O O O N C C C C C C C C C C H H H H H H H H H H H
charge: -0.267210 -0.261904 -0.209232 -0.216059 0.139946 -0.602145 -0.080813 0.547270 -0.518647 0.195219 -0.386071 -0.684282 0.165860 -0.331648 -0.202140 0.246331 0.238929 0.269668 0.263839 0.241706 0.236310 0.238276 0.243541 0.253447 0.239449 0.240361
chargesum: 0.00000
title: Mulliken charges with hydrogens summed into heavy atoms:
elementType: O O O O N C C C C C C C C C C
charge: -0.267210 -0.261904 -0.209232 -0.216059 0.139946 -0.116885 0.188855 0.547270 -0.254809 0.195219 -0.144365 0.033845 0.165860 -0.078201 0.277670
polarizability: 1.90744675e+02 9.11838620e+00 1.24056890e+02 -1.00908345e+01 8.59161419e+00 7.80191337e+01
1716.lowfreq: -34.1632 -6.4780 -0.0006 -0.0002 0.0000 5.9248 7.4943 25.3087 32.5112
frequency: -33.9334 25.2344 32.4608 42.7417 63.1837 168.1828 176.9626 202.8311 227.2936 256.1854 281.3155 326.5363 349.2984 415.2287 425.1407 491.2767 507.6088 588.3548 600.6264 657.0199 665.5972 680.8561 720.9840 760.6572 778.9225 795.6183 820.4661 839.6101 864.7035 887.2745 898.0587 927.9725 934.8249 977.7533 1039.7183 1059.9724 1065.8709 1072.8308 1119.6439 1119.9850 1133.2900 1185.2487 1216.3382 1227.8120 1254.4530 1256.9285 1273.8812 1321.3791 1330.1392 1365.3332 1388.8665 1399.4475 1429.9254 1441.3794 1469.3263 1471.3118 1477.9289 1482.4472 1488.7633 1609.8103 1627.3698 3000.2928 3001.9711 3015.5717 3060.6487 3077.2281 3094.2758 3102.1838 3110.5791 3133.6640 3165.6174 3181.8560
redmass: 2.3149 9.6386 4.7114 5.0210 5.9945 7.0328 6.4896 1.0857 5.2199 4.3347 3.5895 3.4543 4.0935 3.4554 3.2300 6.1664 3.9863 5.6628 4.2391 4.6526 8.9392 9.6432 4.5111 6.1746 6.0678 3.2160 1.6505 8.5823 1.9526 1.7601 1.9896 2.1323 1.3520 5.2250 1.8964 3.0167 1.4552 1.7051 2.3290 1.0485 1.3803 1.7050 2.4268 1.8593 1.8125 4.1985 1.3935 1.5352 1.3860 1.2785 1.2420 3.9069 3.6539 4.4315 1.0582 1.0819 2.1110 1.0815 1.3569 7.7429 8.2404 1.0366 1.0598 1.0534 1.0924 1.0967 1.1191 1.1002 1.0999 1.0903 1.0931 1.0954
irintensity: 14.9233 0.1273 1.9821 1.0301 1.3054 5.5714 0.1135 0.2310 0.8022 1.6837 3.3779 1.0604 1.5193 5.8113 6.7495 4.9974 6.4536 1.4257 8.0362 4.6367 3.8735 0.3614 2.5435 6.5527 18.5298 29.6645 39.5975 29.5086 12.1796 13.6150 2.1914 6.7853 0.8108 140.0790 15.0624 15.3775 4.5165 7.1220 11.6227 0.1736 8.0578 30.4530 92.0328 22.9046 108.9654 162.8677 3.5257 8.7829 2.2736 1.0453 35.9558 9.0646 109.6088 48.4330 9.7403 1.1933 129.8632 15.3077 34.4374 6.0754 1.1219 15.8963 9.9483 121.2351 1.0985 8.3552 31.1841 17.5530 11.3023 8.5135 2.4023 3.2108
temp: 298.150 k
press: 1.00000 atm
elementType: 8 8 8 8 7 6 6 6 6 6 6 6 6 6 6 1 1 1 1 1 1 1 1 1 1 1
symmnumber: 1
zpe: 518366.3 jmol-1
zpe.correction: 0.197435 hartree
zpe.thermalcorrener: 0.210549 hartree
zpe.thermalcorrenthalpy: 0.211493 hartree
zpe.thermalcorrgfe: 0.155328 hartree
zpe.sumelectzpe: -742.092451 hartree
zpe.sumelectthermal: -742.079337 hartree
zpe.sumelectthermalent: -742.078393 hartree
zpe.sumelectthermalfe: -742.134558 hartree
dipole: -4.6388 -0.2613 1.0713
dipole: 4.7681
quadrupole: -104.4301 -87.0520 -86.6412
quadrupole: 2.1713 2.3300 -2.3923
quadrupole: -11.7223 5.6557 6.0666 2.1713 2.3300 -2.3923
hfenergy: -742.2898858 hartree
pointgroup: C01 [X(C10H11N1O4)]
dipole: 1.8193165 -0.173054 -0.4233259 debye
dipolederiv: -1.2337415 0.348045 0.0818436 0.4990763 -0.6039332 0.0124349 0.0794439 0.0243568 -0.2711291 -1.4446765 0.2611769 0.128984 0.2705676 -0.4708253 0.0141174 0.1884334 0.0057014 -0.2792169 -0.6742905 0.2504783 -0.0395471 0.2618449 -0.5846194 0.2204994 0.1123794 0.1598021 -0.3083894 -0.5985121 -0.1092891 0.1562062 0.0296214 -0.5813528 0.1903921 0.1844549 0.2611312 -0.3896044 1.1245546 -0.1640724 -0.1640916 -0.3443355 0.8699681 -0.4819995 -0.4871312 -0.4948058 0.3551869 0.1858501 0.0230196 0.0179207 0.06006 0.1135702 -0.0022304 0.1211341 -0.0210456 0.0573745 -0.0716174 -0.0035502 0.043497 0.0407442 0.1572154 0.0709109 0.0648009 0.0878783 0.2094496 0.1063571 -0.0265856 0.0068029 0.0907419 0.0041402 -0.0376555 -0.0901656 -0.0123385 -0.093732 -0.1165159 0.0979841 -0.0487298 -0.0560516 0.0029958 -0.0434486 -0.0446171 -0.0655779 -0.1374171 0.5611444 -0.3591513 -0.0007186 -0.9794669 0.4709553 0.049842 0.1578588 -0.0429635 0.0372474 -0.1075868 0.0541155 -0.0463219 -0.0741467 -0.0138025 -0.0200866 -0.0074749 -0.0545199 -0.1615262 -0.0811146 0.0101229 0.0095951 -0.0515332 -0.0301011 -0.0503273 0.0136062 -0.0713292 0.0122906 1.2118259 -0.2193715 -0.1525982 0.2534815 -0.1317438 -0.003163 -0.3274012 0.0906515 0.0645994 -0.1127936 -0.0410169 -0.012934 0.1181903 0.0790495 -0.073646 -0.0393923 -0.0499924 -0.1255652 1.1533899 -0.2163305 -0.0440855 -0.281733 0.618516 0.0316691 -0.045518 0.0344507 0.5711976 0.0296937 -0.016267 0.0005091 -0.0447522 -0.0286606 0.0996663 -0.0002922 0.0425116 0.0371832 -0.0114624 0.0231784 0.0328089 0.050393 -0.0438727 -0.1040314 -0.0025274 -0.0554611 0.0145589 0.0233993 0.0095977 0.0077598 -0.0177471 -0.0413923 0.0542504 0.0399984 0.0242437 0.0238112 0.0922153 -0.0507204 0.0414046 -0.0435535 -0.003623 0.0472779 0.0397236 0.0517133 0.1451588 0.0026561 0.1107585 0.0109176 0.0979478 0.0080003 0.0218046 0.0106195 0.01845 0.1406178 0.011862 -0.0244525 -0.1251876 0.0111948 0.0709056 -0.0109173 -0.1168615 -0.0376674 -0.0563323 0.1169654 -0.0259136 0.0163412 -0.0120231 -0.0075119 0.0416158 0.0226434 0.113093 0.014132 -0.0602798 0.0227719 0.073282 0.0566071 0.080882 -0.0053888 0.1100698 0.0121901 0.0980037 0.0685543 -0.0492855 0.0327602 -0.0524166 -0.0025139 0.0549565 0.040528 0.057139 0.1538283 -0.0442695 0.0494354 0.0395502 0.0930109 0.0110065 -0.0659749 0.1361863 -0.0983165 -0.0765242 -0.1316074 0.0453223 -0.0659686 0.0242776 0.0567476 -0.0105681 -0.1604994 0.0207051 -0.0352033 unknown
polarizability: 190.1973639|-11.3381186|122.7752052|-10.2603434|-11.9589389|79.8481294 unknown
InChI: InChI=1S/C10H11NO4/c1-7(11(12)13)4-8-2-3-9-10(5-8)15-6-14-9/h2-3,5,7H,4,6H2,1H3
charge 0 multiplicity 1
26 atoms
O  3.171977 -1.569005 0.288712
O  3.987468 0.562669 -0.469375
O  -4.613998 1.088179 -0.368114
O  -4.365386 -0.894833 0.732948
N  -3.922713 0.066978 0.000882
C  -1.571658 0.139112 0.847665
C  -2.446676 0.005939 -0.436069
C  -0.097482 0.296492 0.50394
C  0.786485 -0.819155 0.610047
C  2.122672 -0.618224 0.258964
C  0.397111 1.549758 0.057949
C  -2.208142 -1.294014 -1.218481
C  2.601539 0.632058 -0.186149
C  1.760332 1.741614 -0.296089
C  4.385867 -0.841032 -0.173782
H  -1.74332 -0.754201 1.473919
H  -1.923897 1.018897 1.418773
H  -2.320436 0.893341 -1.078305
H  0.433955 -1.793462 0.960513
H  -0.287712 2.403525 -0.004811
H  -2.845115 -1.341476 -2.118526
H  -2.423929 -2.171317 -0.585166
H  -1.153098 -1.333609 -1.536826
H  2.136634 2.710779 -0.632446
H  4.755396 -1.312369 -1.100575
H  5.134124 -0.839042 0.637201
