program: Gaussian 09
title: 000292117
version: EM64L-G09RevD.01
frameworkgroup: C1[X(C11H14N4O5)]
method: RPBEPBE
basis: SDD
operation: Freq
keyword: #p
keyword: freq=noraman
keyword: PBEPBE/SDD
title: #p freq=noraman PBEPBE/SDD
converged: YES YES NO NO
title: Mulliken charges:
elementType: O O O O O N N N N C C C C C C C C C C C H H H H H H H H H H H H H H
charge: -0.251546 -0.414815 -0.499995 -0.426217 -0.200864 -0.199054 -0.441620 -0.018193 -0.017685 -0.142043 -0.156281 -0.186385 -0.101042 -0.317306 0.340865 -0.231230 -0.151297 -0.001239 0.155415 -0.776131 0.252662 0.284582 0.287321 0.258005 0.215235 0.231584 0.359382 0.268513 0.385449 0.392017 0.358979 0.285634 0.233336 0.223963
chargesum: 0.00000
title: Mulliken charges with hydrogens summed into heavy atoms:
elementType: O O O O O N N N N C C C C C C C C C C C
charge: -0.251546 -0.055433 -0.114546 -0.067238 -0.200864 -0.199054 -0.049603 -0.018193 -0.017685 0.110620 0.128301 0.100936 0.156963 0.129513 0.340865 0.037283 -0.151297 -0.001239 0.155415 -0.033198
polarizability: 1.98853180e+02 -8.82484574e-01 1.68713686e+02 -9.25620184e+00 -1.23883103e+01 1.12737313e+02
1716.lowfreq: -16.3855 -11.0189 -3.9304 0.0006 0.0006 0.0007 7.8731 36.7839 53.3762
frequency: -15.5613 36.6424 53.3455 72.6241 80.6449 94.8211 118.8590 132.4567 163.3171 189.1217 213.3909 224.9578 272.8325 289.6860 299.0306 303.9874 316.6305 338.8267 374.7115 383.1415 403.8389 411.8513 438.0533 450.8068 464.3391 503.2900 528.0902 592.1750 605.3045 635.7387 639.6875 659.7678 722.2560 736.4940 755.8053 758.2346 782.9836 791.4653 825.2027 863.7486 888.0651 906.5368 922.4807 944.6059 963.1410 965.9778 987.2495 1013.7524 1020.7852 1024.6602 1046.3631 1054.1163 1067.1691 1089.7870 1131.2264 1163.9789 1174.7278 1202.0664 1210.0267 1218.2049 1251.2058 1265.4757 1275.1695 1282.6960 1288.8557 1308.6056 1325.0605 1343.3749 1359.9604 1369.2905 1373.9453 1383.2245 1391.3856 1415.8326 1446.0697 1451.4551 1458.2566 1472.0619 1530.2964 1564.2678 1615.9496 1634.9529 2983.7894 2994.9901 3032.1243 3050.1683 3057.1893 3063.7883 3092.4063 3097.8960 3137.9049 3175.2603 3225.0794 3532.5036 3552.1322 3606.2339
redmass: 5.8555 6.6968 6.1860 1.0646 5.6927 3.1733 6.7448 5.0739 5.3247 4.7246 6.5143 6.9505 5.9309 3.9737 4.3887 4.0974 4.8570 1.2449 1.1208 5.7298 5.1902 3.5587 2.9531 1.4025 7.0313 5.5264 6.6279 5.2097 4.9837 3.9209 5.3433 11.9020 6.5092 4.1300 1.9420 3.7442 5.8542 4.7538 6.9677 2.7920 1.2787 3.9615 6.0607 3.3948 2.2595 2.1217 5.5699 3.8937 5.8923 3.6382 1.5566 3.3395 3.2585 2.1135 2.9992 1.2869 1.5998 1.6527 1.3408 1.4307 3.8960 1.3185 2.4790 1.4234 1.5271 1.2850 3.9863 1.1652 1.3527 1.4966 1.3890 1.7850 1.2649 1.6464 1.7632 1.0899 1.6491 1.0509 5.5761 2.6115 3.8769 5.9619 1.0395 1.0665 1.0856 1.0865 1.0875 1.0978 1.0882 1.0987 1.0969 1.0886 1.0984 1.0664 1.0658 1.0668
irintensity: 0.4901 1.4653 2.4574 0.2748 4.6277 8.9919 0.9039 0.5372 0.0675 0.6472 1.7489 12.1984 5.5226 13.5102 1.6001 7.3846 1.5669 70.9033 179.3883 0.8936 4.6678 21.6107 54.2797 61.3341 12.2837 12.4617 10.9269 3.3795 2.6643 10.3097 4.5426 3.5098 33.2149 46.6882 30.6947 11.6199 20.6368 1.0505 32.7397 14.8268 80.6684 82.5195 31.8447 78.1641 48.2085 30.7071 74.9298 48.0002 58.2183 120.6231 10.7111 17.3815 11.4196 19.7376 49.1667 27.9990 17.1212 52.9918 34.4973 27.3428 111.2143 4.1697 3.8905 3.6021 8.4687 10.4759 88.1466 17.7228 13.8158 2.3914 23.2036 16.5781 34.5867 39.6968 18.2381 3.2322 13.4594 19.5133 249.4707 33.2951 265.1093 300.1197 16.0005 28.5979 9.0606 32.7326 20.5152 18.0253 9.5469 18.0574 4.1918 810.3104 0.2441 18.9893 11.9887 37.5115
temp: 298.150 k
press: 1.00000 atm
elementType: 8 8 8 8 8 7 7 7 7 6 6 6 6 6 6 6 6 6 6 6 1 1 1 1 1 1 1 1 1 1 1 1 1 1
symmnumber: 1
zpe: 675483.0 jmol-1
zpe.correction: 0.257278 hartree
zpe.thermalcorrener: 0.274967 hartree
zpe.thermalcorrenthalpy: 0.275911 hartree
zpe.thermalcorrgfe: 0.211862 hartree
zpe.sumelectzpe: -1021.152492 hartree
zpe.sumelectthermal: -1021.134802 hartree
zpe.sumelectthermalent: -1021.133858 hartree
zpe.sumelectthermalfe: -1021.197908 hartree
dipole: 12.5717 3.3698 -4.9127
dipole: 13.9117
quadrupole: -154.8433 -110.3548 -122.6829
quadrupole: -10.0763 -1.5284 -10.5721
quadrupole: -25.5496 18.9389 6.6108 -10.0763 -1.5284 -10.5721
hfenergy: -1021.4097695 hartree
pointgroup: C01 [X(C11H14N4O5)]
dipole: 4.9004959 -0.0001415 -2.4376612 debye
polarizability: 196.1228306|-10.151529|157.6696165|-14.6347432|-24.8284097|126.5117319 unknown
InChI: InChI=1S/C11H14N4O5/c1-4-13-9-6(10(19)14-4)12-3-15(9)11-8(18)7(17)5(2-16)20-11/h3,5,7-8,11,13,16-18H,2H2,1H3
charge 0 multiplicity 1
34 atoms
O  2.273193 -0.794318 1.1940
O  2.951567 -2.291096 -1.5082
O  1.87188 1.241663 -1.558126
O  2.862876 1.71894 2.514321
O  -4.467596 0.157271 0.953366
N  -0.033702 -1.302783 0.480737
N  -0.680137 0.887632 -0.59864
N  -2.089626 -1.789605 1.393857
N  -2.988339 1.527186 -0.270091
C  1.396385 -1.53926 0.267614
C  1.988272 -1.249936 -1.141648
C  2.70113 0.136557 -1.027504
C  2.955991 0.344893 0.488694
C  2.474405 1.669065 1.107646
C  -0.903247 -0.258059 0.137712
C  -0.832191 -2.198596 1.257179
C  -2.160209 -0.565311 0.695331
C  -3.305857 0.339899 0.506918
C  -1.785893 1.751396 -0.764177
C  -1.512647 2.993115 -1.585269
H  1.543117 -2.607386 0.503249
H  1.235565 -1.274099 -1.944493
H  3.645258 0.093328 -1.598183
H  4.02711 0.228948 0.733852
H  1.380011 1.7855 0.984211
H  2.979843 2.522163 0.627654
H  3.611459 -2.410263 -0.775483
H  -0.406562 -3.110022 1.673152
H  2.050496 1.368239 -2.52125
H  0.245075 1.121372 -1.015106
H  2.425428 0.962427 2.983943
H  -2.356929 3.685128 -1.459949
H  -1.42607 2.746427 -2.660687
H  -0.579254 3.495787 -1.270828
