program: Gaussian 09
title: 000292105
version: EM64L-G09RevD.01
frameworkgroup: C1[X(C9H17N3O7)]
method: RPBEPBE
basis: SDD
operation: Freq
keyword: #p
keyword: freq=noraman
keyword: PBEPBE/SDD
title: #p freq=noraman PBEPBE/SDD
converged: YES YES NO NO
title: Mulliken charges:
elementType: O O O O O O O N N N C C C C C C C C C H H H H H H H H H H H H H H H H H
charge: -0.291738 -0.475538 -0.459673 -0.451653 -0.263005 -0.278344 -0.241968 -0.353195 -0.155465 0.032412 -0.198065 0.015109 -0.187385 -0.103909 -0.036272 -0.460617 -0.506388 0.334026 -0.622859 0.232352 0.275364 0.276781 0.248153 0.254226 0.244158 0.241307 0.366473 0.369937 0.359803 0.361534 0.229377 0.216326 0.238496 0.256935 0.257103 0.276206
chargesum: 0.00000
title: Mulliken charges with hydrogens summed into heavy atoms:
elementType: O O O O O O O N N N C C C C C C C C C
charge: -0.291738 -0.109065 -0.089736 -0.091850 -0.263005 -0.278344 -0.241968 0.008339 -0.155465 0.032412 0.034286 0.290473 0.089395 0.144245 0.217954 0.024847 0.177810 0.334026 0.167385
polarizability: 1.76321394e+02 -8.73533278e+00 1.59157761e+02 -8.97550472e+00 -7.62297756e+00 1.01634786e+02
1716.lowfreq: -0.0006 0.0005 0.0006 5.7080 7.0107 12.1819 22.3700 27.3922 29.9352
frequency: 21.3850 27.3268 29.8599 52.8604 78.4763 93.1512 101.2040 114.4519 132.7683 147.2522 158.4390 178.5729 208.4374 212.9005 230.7481 245.7679 252.7298 282.3239 289.7265 299.4651 321.7553 358.7046 379.8893 391.2491 395.2628 444.7228 452.6383 469.1309 481.3765 496.7908 567.2622 574.0074 585.6101 681.6046 684.5667 703.4040 731.9984 745.9014 791.3031 832.5283 851.5173 885.2736 915.3357 935.7680 981.5170 997.7837 1019.5762 1028.3729 1041.5284 1043.6888 1075.3920 1082.0472 1088.4418 1110.3150 1115.7325 1116.5714 1147.0368 1162.7251 1175.1076 1197.1188 1213.2938 1231.6790 1253.2625 1262.6589 1277.8705 1282.0440 1293.1751 1303.4187 1311.5961 1327.4773 1350.0455 1360.3751 1366.6093 1376.4052 1383.0016 1400.3184 1412.2156 1434.7386 1458.3037 1459.2051 1461.9688 1470.1510 1473.9676 1497.7403 1662.7485 2963.5334 2979.3769 2984.6669 2988.2449 3005.9232 3008.0556 3033.5575 3055.1186 3071.6809 3074.4765 3090.9264 3122.5407 3148.3830 3456.3784 3508.9779 3509.8016 3609.7023
redmass: 5.0297 6.1516 6.7865 5.1697 4.1058 4.7346 3.2452 1.8122 1.1325 6.4948 2.2626 5.0030 3.9773 3.4979 1.5614 4.1427 2.8213 3.8450 5.3066 3.9733 4.0246 4.1186 5.5609 5.9932 5.6188 3.4887 7.9342 1.2426 4.9679 5.2127 2.7390 1.2320 4.5396 4.4764 3.7821 9.6741 2.7468 1.3204 3.7798 5.5592 4.0025 4.6874 3.2767 5.0843 4.2297 4.1552 4.2264 5.2620 2.7597 3.6388 3.0742 3.8508 2.5116 1.3471 1.3604 2.0420 1.3742 2.7240 1.3670 2.2111 1.2164 1.2647 1.3325 1.2342 2.1037 1.6053 1.3460 1.2270 1.1719 1.3400 1.3849 9.0441 1.2589 1.4244 1.3489 1.5927 1.1936 1.1702 1.0921 1.0527 1.0438 1.0866 1.0556 1.9736 9.9469 1.0328 1.0838 1.0827 1.0704 1.0336 1.0814 1.0870 1.1028 1.0980 1.0869 1.1009 1.1005 1.1010 1.0643 1.0649 1.0771 1.0672
irintensity: 0.8986 0.5688 0.7072 2.7484 3.1844 11.2195 3.0818 1.8396 1.2443 7.3051 4.1814 0.5901 7.5355 1.1797 121.6988 7.1388 28.2354 9.9470 19.2671 4.2808 7.1031 9.0192 11.2260 2.4018 10.6789 2.3448 2.7439 48.4006 2.9766 9.1443 30.3661 199.9810 30.1732 3.5039 57.7517 9.1543 27.9269 138.2692 6.0012 67.3127 29.2685 93.3167 71.1384 331.6588 64.8099 13.8324 109.9281 63.4678 28.4290 41.0571 62.5666 27.5758 10.1466 0.5849 1.3214 12.8348 7.3155 54.2647 22.0090 5.4157 48.4511 53.3170 2.5034 76.4095 35.2884 40.9074 14.9298 15.6533 6.1046 8.3481 2.3003 133.4110 9.8689 14.7801 28.5757 30.0493 42.1137 4.1524 29.1678 11.8114 23.0759 16.5102 6.4683 405.4423 273.2940 50.9123 16.9902 17.9255 34.7801 14.4831 31.3891 29.9634 47.1060 3.5339 19.4262 12.7761 20.8837 0.2289 40.9902 20.8797 55.5388 18.7416
temp: 298.150 k
press: 1.00000 atm
elementType: 8 8 8 8 8 8 8 7 7 7 6 6 6 6 6 6 6 6 6 1 1 1 1 1 1 1 1 1 1 1 1 1 1 1 1 1
symmnumber: 1
zpe: 736624.6 jmol-1
zpe.correction: 0.280565 hartree
zpe.thermalcorrener: 0.301314 hartree
zpe.thermalcorrenthalpy: 0.302258 hartree
zpe.thermalcorrgfe: 0.229497 hartree
zpe.sumelectzpe: -1042.376762 hartree
zpe.sumelectthermal: -1042.356014 hartree
zpe.sumelectthermalent: -1042.355070 hartree
zpe.sumelectthermalfe: -1042.427831 hartree
dipole: -1.1284 -3.0676 0.0564
dipole: 3.2690
quadrupole: -123.8111 -113.5760 -111.8532
quadrupole: -4.4460 -0.8085 0.2958
quadrupole: -7.3976 2.8374 4.5602 -4.4460 -0.8085 0.2958
hfenergy: -1042.6573278 hartree
pointgroup: C01 [X(C9H17N3O7)]
dipole: 0.4148003 1.2172571 -0.0189979 debye
polarizability: 175.7218608|-8.0700744|159.3683248|12.6934584|4.594867|102.0237548 unknown
InChI: InChI=1S/C9H17N3O7/c1-12(11-17)9(16)10-3-4-5(13)6(14)7(15)8(18-2)19-4/h4-8,10,13-15H,3H2,1-2H3
charge 0 multiplicity 1
36 atoms
O  -0.931795 -0.600017 -0.869578
O  -2.609162 2.11362 0.961439
O  -4.666195 1.015967 -0.278256
O  -4.255998 -1.786079 -0.094755
O  -1.25649 -2.092797 1.001582
O  2.764358 2.365486 0.520446
O  4.466876 -1.882909 0.060488
N  1.553762 0.67054 -0.559927
N  3.726555 0.226162 0.27459
N  3.487223 -1.083456 -0.137525
C  -2.220074 1.453157 -0.305867
C  -0.872981 0.695919 -0.146854
C  -3.356535 0.442944 -0.59771
C  -3.161724 -0.865709 0.202782
C  -1.847208 -1.55867 -0.19777
C  0.323106 1.438849 -0.753144
C  -0.146241 -3.029978 0.756846
C  2.641655 1.184554 0.090752
C  4.997516 0.631146 0.896795
H  -2.171223 2.203931 -1.120727
H  -0.706584 0.499073 0.931549
H  -3.382374 0.204717 -1.673333
H  -3.126094 -0.625867 1.286616
H  -2.022513 -2.338436 -0.96247
H  0.45923 2.426631 -0.278531
H  0.13904 1.593065 -1.83482
H  -2.13593 2.973989 1.065479
H  -4.518759 1.607197 0.512257
H  -5.093443 -1.252586 -0.033589
H  1.559036 -0.316004 -0.836849
H  0.712471 -2.524322 0.276767
H  -0.480633 -3.874498 0.122202
H  0.149647 -3.405608 1.747662
H  5.830531 0.477601 0.18921
H  5.190035 0.016073 1.792555
H  4.907118 1.692614 1.166188
