program: Gaussian 09
title: 000292094
version: EM64L-G09RevD.01
frameworkgroup: C1[X(C14H12N2O4)]
method: RPBEPBE
basis: SDD
operation: Freq
keyword: #p
keyword: freq=noraman
keyword: PBEPBE/SDD
title: #p freq=noraman PBEPBE/SDD
converged: NO YES NO NO
title: Mulliken charges:
elementType: O O O O N N C C C C C C C C C C C C C C H H H H H H H H H H H H
charge: -0.286254 -0.276799 -0.216638 -0.232345 -0.492133 0.016449 0.304774 0.322708 0.054859 0.181444 -0.370000 -0.349062 -0.305651 -0.333005 -0.220744 -0.250231 -0.230118 -0.234415 0.196694 -0.498210 0.425179 0.277552 0.283385 0.275699 0.283852 0.233848 0.236966 0.235811 0.240966 0.245153 0.247623 0.232645
chargesum: 0.00000
title: Mulliken charges with hydrogens summed into heavy atoms:
elementType: O O O O N N C C C C C C C C C C C C C C
charge: -0.286254 -0.276799 -0.216638 -0.232345 -0.066953 0.016449 0.304774 0.322708 0.054859 0.181444 -0.092449 -0.065677 -0.029952 -0.049154 0.013103 -0.013265 0.005693 0.006551 0.196694 0.227211
polarizability: 3.14169502e+02 -1.70435328e+01 2.19175386e+02 6.53412667e+00 8.07396687e+00 1.00744946e+02
1716.lowfreq: -3.6775 -1.9467 -0.0008 -0.0008 -0.0006 5.3319 32.0750 38.5837 66.3525
frequency: 32.0665 38.5737 66.3452 74.3136 88.2822 99.9496 122.5371 132.8412 155.9198 180.1777 197.1010 233.8142 260.7918 295.5821 318.8280 338.0633 378.8253 403.6059 424.8155 438.6377 487.6469 515.1178 524.6638 527.4389 575.8315 638.1311 650.7708 655.0807 669.1142 683.7463 721.5796 742.1059 758.8904 770.1483 778.6155 782.8155 792.0151 815.7591 862.6740 884.4178 892.0425 925.0565 966.4661 977.4889 989.4123 998.0613 1037.6746 1048.3856 1052.7626 1066.2801 1115.0165 1132.6905 1143.0022 1149.8835 1172.6229 1179.8027 1203.5602 1226.4098 1230.3432 1264.4736 1303.2715 1324.1928 1346.2235 1368.8817 1389.7647 1424.8805 1433.7375 1442.0474 1451.6315 1463.1437 1466.8804 1479.3830 1512.2435 1567.9257 1582.3666 1592.5655 1616.1409 1626.7828 3007.0023 3109.9302 3135.9266 3140.9637 3151.0899 3157.0870 3162.5306 3168.7521 3175.0828 3183.6725 3185.6746 3233.3280
redmass: 5.8120 7.2666 5.3340 5.2756 5.6111 1.4500 2.7246 4.3314 4.4422 5.0540 6.0160 5.4663 5.5269 5.9635 5.3492 5.6982 9.0156 8.3461 3.8362 3.8202 5.9263 3.6914 3.4607 6.2829 6.1044 5.9899 7.0826 6.1447 5.2405 5.4830 3.6872 2.1762 3.1676 1.5483 1.7496 1.9038 6.3354 5.0989 1.4392 4.6262 1.3818 7.1904 1.3613 1.3504 1.3330 1.3098 2.6063 2.7569 3.8179 3.3036 1.2621 1.8254 1.9292 1.5049 1.1463 1.0780 5.1632 2.2001 1.7446 2.4454 1.7206 3.1517 3.1439 4.0965 7.5870 1.3078 2.7726 2.3735 1.0494 1.1363 2.1258 2.7444 2.6345 7.1765 4.6655 5.0288 5.7027 5.4194 1.0294 1.1046 1.0868 1.0872 1.1050 1.0906 1.0902 1.0955 1.0942 1.0978 1.0989 1.0786
irintensity: 2.1612 0.9738 0.7203 1.1706 0.5300 1.3272 0.6074 0.8208 5.4659 1.8083 0.8911 10.8132 3.3753 5.6169 6.6445 17.0644 1.8610 1.1554 6.7744 1.4494 8.2770 2.7264 25.5457 1.7024 1.4200 5.6129 2.9793 5.0754 23.4817 4.2314 10.1408 14.6836 29.2293 101.5683 84.3356 41.2196 7.4905 3.3569 1.1387 2.1328 0.5572 6.0230 4.5120 0.2550 1.2838 1.0101 15.2198 47.8546 149.5963 6.6782 0.1012 31.4249 7.5349 101.9561 44.7687 1.8545 406.0885 87.1737 167.6208 285.4664 28.0009 43.7437 173.3603 8.8689 0.5636 34.3973 6.8138 45.7973 14.8970 63.1272 117.3817 51.0997 361.7332 124.1129 331.9145 25.5442 69.0284 67.1224 39.7345 23.4311 5.2574 7.7625 17.8208 17.2319 9.8637 3.8538 3.5446 10.7959 10.6941 145.6430
temp: 298.150 k
press: 1.00000 atm
elementType: 8 8 8 8 7 7 6 6 6 6 6 6 6 6 6 6 6 6 6 6 1 1 1 1 1 1 1 1 1 1 1 1
symmnumber: 1
zpe: 622609.5 jmol-1
zpe.correction: 0.237139 hartree
zpe.thermalcorrener: 0.254495 hartree
zpe.thermalcorrenthalpy: 0.255439 hartree
zpe.thermalcorrgfe: 0.190764 hartree
zpe.sumelectzpe: -949.604325 hartree
zpe.sumelectthermal: -949.586969 hartree
zpe.sumelectthermalent: -949.586025 hartree
zpe.sumelectthermalfe: -949.650700 hartree
dipole: -2.3311 5.0048 2.2754
dipole: 5.9716
quadrupole: -96.9775 -111.4869 -117.9044
quadrupole: 15.7818 6.6378 -6.5246
quadrupole: 11.8121 -2.6973 -9.1148 15.7818 6.6378 -6.5246
hfenergy: -949.841464 hartree
pointgroup: C01 [X(C14H12N2O4)]
dipole: -0.9441358 1.9581665 0.8909835 debye
polarizability: 314.6504815|-15.6557525|218.7518725|6.220967|7.8651065|100.687481 unknown
InChI: InChI=1S/C14H12N2O4/c1-20-14(17)10-6-2-3-7-11(10)15-12-8-4-5-9-13(12)16(18)19/h2-9,15H,1H3
charge 0 multiplicity 1
32 atoms
O  -3.821269 -1.405543 0.576361
O  -1.606586 -2.050496 0.305037
O  3.531065 -2.40155 -1.284416
O  1.297573 -2.384747 -0.827739
N  0.194975 -0.08018 -0.098296
N  2.483258 -1.843242 -0.770422
C  -0.910954 0.772599 -0.284628
C  1.505485 0.289209 0.213513
C  -2.250612 0.269714 -0.113939
C  2.633311 -0.555877 -0.089731
C  -0.748956 2.122472 -0.716486
C  1.796742 1.51193 0.899459
C  -3.35781 1.133955 -0.334049
C  3.95834 -0.172488 0.243803
C  -1.860578 2.954606 -0.93083
C  -3.177064 2.470087 -0.728158
C  3.107427 1.875631 1.236572
C  4.205749 1.038917 0.900479
C  -2.486228 -1.144048 0.266417
C  -4.125304 -2.813577 0.926782
H  0.012739 -1.100747 -0.176806
H  0.254398 2.501149 -0.92798
H  0.964904 2.150241 1.207428
H  -4.361139 0.724616 -0.191335
H  4.767241 -0.855311 -0.029241
H  -1.700245 3.981698 -1.2772
H  -4.041136 3.120283 -0.895225
H  3.277831 2.809459 1.783375
H  5.227482 1.325738 1.165296
H  -3.558362 -3.113581 1.823771
H  -3.857633 -3.481325 0.090964
H  -5.207445 -2.824995 1.117222
