program: Gaussian 09
title: 000292085
version: EM64L-G09RevD.01
frameworkgroup: C1[X(C13H9ClN2O2)]
method: RPBEPBE
basis: SDD
operation: Freq
keyword: #p
keyword: freq=noraman
keyword: PBEPBE/SDD
title: #p freq=noraman PBEPBE/SDD
converged: YES YES NO NO
title: Mulliken charges:
elementType: Cl O O N N C C C C C C C C C C C C C H H H H H H H H H
charge: -0.051917 -0.204334 -0.195213 -0.063476 0.021031 0.482494 -0.482473 0.380042 -0.377551 0.349933 -0.359514 -0.368215 -0.192982 -0.273060 -0.346307 -0.214468 -0.211655 -0.232429 0.326459 0.242583 0.290717 0.245466 0.243191 0.259738 0.256157 0.237539 0.238244
chargesum: 0.00000
title: Mulliken charges with hydrogens summed into heavy atoms:
elementType: Cl O O N N C C C C C C C C C C C C C
charge: -0.051917 -0.204334 -0.195213 -0.063476 0.021031 0.482494 -0.156013 0.380042 -0.134968 0.349933 -0.068797 -0.122749 0.050209 -0.273060 -0.086569 0.041690 0.025883 0.005815
polarizability: 3.16027917e+02 -3.12601976e+01 1.84131158e+02 3.26751708e-01 -1.45045184e+00 8.55836592e+01
1716.lowfreq: -7.7224 -2.6806 0.0007 0.0012 0.0014 4.4357 17.2670 39.8236 47.0602
frequency: 17.0813 39.8142 47.0589 59.6905 101.9188 136.0440 158.2481 171.3144 221.5706 245.0070 270.3501 290.0183 331.8103 377.0309 399.2298 428.2086 446.6144 474.5888 500.0215 538.9641 544.7667 555.5668 633.3066 654.0315 667.1931 686.4052 702.6043 715.5150 759.6888 768.6172 819.3769 828.8022 861.5745 926.4139 935.1037 946.0648 968.8655 983.2728 987.9222 991.1816 1004.7944 1013.2971 1035.1047 1074.0077 1087.5601 1119.5383 1167.8077 1175.4571 1179.2588 1215.9148 1240.7147 1255.2896 1275.1062 1354.0734 1364.2255 1377.1309 1405.8717 1425.9171 1436.6374 1451.2460 1480.7344 1557.9811 1578.8455 1589.5674 1613.2750 1626.5594 3004.9782 3133.1598 3142.0649 3155.5893 3161.9149 3168.0324 3179.0744 3181.9085 3188.1544
redmass: 8.7809 8.9317 6.5511 8.3442 6.3229 6.6149 4.5222 5.8538 7.9928 5.1246 5.0328 4.2741 6.0763 9.1320 7.7010 3.2457 3.5155 6.0516 5.6222 5.2718 6.8169 4.3223 6.5288 7.4185 7.2000 2.4154 4.4582 3.9122 1.5638 4.0236 1.5252 5.7311 1.4008 4.1162 1.3725 1.3967 1.4152 1.3308 6.0523 1.6266 1.3963 7.2889 2.1161 1.7131 1.7546 1.6287 1.1492 1.1732 2.4927 6.8586 2.2255 1.5230 1.3357 7.3246 1.8442 11.6893 3.9455 2.4154 2.7217 2.4394 3.1885 6.1115 7.0420 6.8003 6.8711 7.3363 1.0887 1.0895 1.0857 1.0902 1.0930 1.0950 1.1008 1.0922 1.0965
irintensity: 1.5561 0.2505 0.5572 1.4059 0.8016 1.0623 6.2960 2.1381 2.0413 13.7917 6.6633 2.5266 0.3142 2.0421 4.0059 1.8486 8.7235 7.3834 17.9729 2.4515 7.1850 5.4729 1.1865 17.9841 20.6617 24.9035 23.4719 0.7488 95.7941 11.2667 34.1683 19.0107 1.7738 9.0421 2.4191 3.2918 5.5763 0.8623 0.4068 20.6404 2.7222 46.7960 13.4010 45.7252 16.3012 2.5619 2.5265 7.7323 56.5781 219.5384 21.2361 5.7404 2.9086 3.6417 2.9567 110.6906 0.8585 13.6844 18.2405 19.8548 35.9975 2.9781 41.8244 4.6685 3.6556 60.9861 30.3101 6.0793 1.7879 7.0801 14.4895 7.9445 18.3047 6.3029 5.1194
temp: 298.150 k
press: 1.00000 atm
elementType: 17 8 8 7 7 6 6 6 6 6 6 6 6 6 6 6 6 6 1 1 1 1 1 1 1 1 1
symmnumber: 1
zpe: 500108.7 jmol-1
zpe.correction: 0.190481 hartree
zpe.thermalcorrener: 0.205685 hartree
zpe.thermalcorrenthalpy: 0.206629 hartree
zpe.thermalcorrgfe: 0.145306 hartree
zpe.sumelectzpe: -1219.447970 hartree
zpe.sumelectthermal: -1219.432767 hartree
zpe.sumelectthermalent: -1219.431823 hartree
zpe.sumelectthermalfe: -1219.493146 hartree
dipole: 3.5975 3.4207 -2.8405
dipole: 5.7194
quadrupole: -110.2703 -106.6226 -112.4652
quadrupole: -22.0384 4.8446 1.2665
quadrupole: -0.4843 3.1634 -2.6792 -22.0384 4.8446 1.2665
hfenergy: -1219.6384518 hartree
pointgroup: C01 [X(C13H9Cl1N2O2)]
dipole: 1.343118 1.8004013 0.1338337 debye
polarizability: 319.7621463|-20.8842722|141.928293|-7.5883933|46.3324714|124.0522943 unknown
InChI: InChI=1S/C13H9ClN2O2/c14-12-6-1-2-7-13(12)15-9-10-4-3-5-11(8-10)16(17)18/h1-9H
charge 0 multiplicity 1
27 atoms
Cl 2.687956 1.002481 2.347764
O  -5.234301 -1.266033 -0.659252
O  -3.271797 -2.344484 -1.086239
N  1.09383 0.006705 -0.297627
N  -3.944603 -1.316549 -0.696157
C  -1.071298 1.015473 0.123138
C  -1.786493 -0.139089 -0.289294
C  -3.190267 -0.10874 -0.260762
C  -1.789386 2.163654 0.554557
C  2.506625 -0.054365 -0.288707
C  -3.920195 1.026363 0.165608
C  0.405192 1.039089 0.113449
C  -3.201712 2.167347 0.575238
C  3.367682 0.332972 0.78135
C  3.124471 -0.644896 -1.430624
C  4.762944 0.158202 0.717725
C  4.520459 -0.792861 -1.521571
C  5.347026 -0.391788 -0.445228
H  -1.244434 -1.028857 -0.620432
H  -1.235716 3.053999 0.876227
H  -5.012685 0.993922 0.168715
H  0.874747 1.982998 0.448385
H  -3.742442 3.057835 0.910278
H  2.463789 -0.977263 -2.237312
H  5.383113 0.451621 1.569708
H  4.961961 -1.235678 -2.420188
H  6.433134 -0.517763 -0.49725
