program: Gaussian 09
title: 000292091
version: EM64L-G09RevD.01
frameworkgroup: C1[X(C12H22O)]
method: RPBEPBE
basis: SDD
operation: Freq
keyword: #pfreq=noraman
keyword: PBEPBE/SDD
title: #p freq=noraman PBEPBE/SDD
converged: YES YES NO NO
title: Mulliken charges:
elementType: O C C C C C C C C C C C C H H H H H H H H H H H H H H H H H H H H H H
charge: -0.198606 -0.109549 -0.478244 -0.449106 -0.013682 -0.411072 0.139052 -0.392007 -0.519684 -0.388605 -0.752593 -0.383617 -0.692242 0.231588 0.212011 0.222445 0.218131 0.208978 0.201304 0.190809 0.215324 0.213715 0.210318 0.217500 0.240910 0.188454 0.188097 0.215264 0.214152 0.210510 0.208597 0.210617 0.209460 0.204571 0.217200
chargesum: 0.00000
title: Mulliken charges with hydrogens summed into heavy atoms:
elementType: O C C C C C C C C C C C C
charge: -0.198606 0.122039 -0.043788 -0.021997 0.187623 -0.004939 0.139052 0.032027 -0.061275 -0.012054 -0.112666 0.035596 -0.061011
polarizability: 1.41690193e+02 4.78051887e+00 1.22308880e+02 5.81880691e-02 -3.48970876e+00 1.18172111e+02
1716.lowfreq: -24.7825 -14.0071 -7.3163 0.0002 0.0005 0.0007 30.7892 42.0726 70.6207
frequency: 30.2938 41.7613 70.5446 80.4771 114.0282 122.4018 160.8899 195.5382 206.1045 219.9443 250.2815 271.7887 296.7934 318.5351 340.4554 394.9807 413.9662 445.2190 516.1227 536.7928 559.1812 651.2310 736.2333 742.0001 784.1475 807.1880 834.7174 855.0910 864.1204 881.3190 893.1913 916.6870 951.0763 960.5175 1007.1734 1010.6082 1034.2817 1048.9694 1059.6029 1061.9706 1087.2349 1111.5650 1115.8026 1135.3546 1151.1256 1173.7431 1183.5531 1224.3698 1237.2641 1243.5239 1252.7357 1275.0699 1276.1723 1285.8399 1295.1234 1302.5281 1314.9077 1329.9946 1333.4906 1339.7062 1342.2544 1359.5365 1363.0884 1386.6585 1389.7165 1447.0960 1461.8716 1465.2417 1465.8219 1466.5135 1475.1567 1476.1183 1476.8327 1477.5265 1482.3176 1489.5063 1622.1254 2931.8234 2941.3714 2958.4309 2968.8348 2969.6834 2970.8712 2971.1445 2972.2948 2977.9331 2981.9100 2985.3150 2994.0717 3029.5988 3032.2753 3037.1386 3039.2629 3047.4570 3065.6198 3066.6454 3068.2151 3070.5744 3071.8156
redmass: 4.2632 3.3699 3.1224 1.7569 3.1747 2.7037 2.1465 1.9963 1.2155 1.4879 2.2302 2.8600 1.7801 2.2765 2.8714 2.4308 2.7439 2.6028 2.6880 2.4219 2.8615 3.0714 1.1146 2.7065 2.2956 1.6109 1.8121 2.0618 1.7030 1.4511 1.8287 1.5081 2.0041 2.0034 1.4431 1.8419 1.5066 2.3480 1.2762 1.9547 1.5694 2.3819 2.1790 2.3293 2.4139 1.9299 1.4909 1.4564 1.4201 1.3092 1.2487 1.3210 1.3526 1.3410 1.1544 1.3183 1.3112 1.5308 1.4317 1.4422 1.5125 1.5759 1.4684 1.2135 1.2213 1.0893 1.0807 1.0818 1.0732 1.0766 1.0618 1.0436 1.0598 1.0785 1.0594 1.0828 9.7141 1.0793 1.0702 1.0711 1.0638 1.0362 1.0617 1.0407 1.0615 1.0611 1.0615 1.0610 1.0967 1.1013 1.0957 1.1010 1.1004 1.1026 1.1000 1.0995 1.0997 1.0993 1.0972
irintensity: 1.7875 0.0869 1.0054 0.2679 1.1245 0.7526 1.0410 0.3627 0.1625 1.2654 1.8771 0.4311 0.1153 0.1444 0.5228 2.5189 1.3206 0.8373 7.3759 3.2143 0.5628 2.6640 8.4652 3.7317 5.1031 1.0628 6.1936 4.4220 4.0123 6.7134 5.1776 1.2053 0.4104 7.9324 7.1787 0.7831 8.6530 0.4042 3.0453 3.9953 4.3955 0.7059 32.7017 5.8264 2.8472 10.0415 0.1575 5.4636 7.2176 10.4509 0.8987 22.0642 0.4750 3.2774 1.9162 9.4668 6.9136 3.7430 3.1556 4.2672 0.0552 1.8867 1.1378 8.5190 18.2779 14.5218 6.8170 3.8129 18.0413 6.2030 2.8927 10.6124 5.8555 7.0005 6.3085 22.1744 138.4053 7.9296 9.9570 55.6632 20.1012 58.1364 6.0511 29.8915 34.8752 15.9112 37.8885 35.4847 29.9080 36.2353 48.1674 29.8110 33.4420 65.5091 52.2284 50.3106 86.6501 58.0283 26.5956
temp: 298.150 k
press: 1.00000 atm
elementType: 8 6 6 6 6 6 6 6 6 6 6 6 6 1 1 1 1 1 1 1 1 1 1 1 1 1 1 1 1 1 1 1 1 1 1
symmnumber: 1
zpe: 826350.4 jmol-1
zpe.correction: 0.314740 hartree
zpe.thermalcorrener: 0.329693 hartree
zpe.thermalcorrenthalpy: 0.330637 hartree
zpe.thermalcorrgfe: 0.272143 hartree
zpe.sumelectzpe: -544.640420 hartree
zpe.sumelectthermal: -544.625468 hartree
zpe.sumelectthermalent: -544.624524 hartree
zpe.sumelectthermalfe: -544.683017 hartree
dipole: 0.0853 2.2131 -2.4956
dipole: 3.3366
quadrupole: -79.3873 -84.8609 -87.4176
quadrupole: 4.6618 -4.4985 5.4021
quadrupole: 4.5013 -0.9723 -3.5290 4.6618 -4.4985 5.4021
hfenergy: -544.9551605 hartree
pointgroup: C01 [X(C12H22O1)]
dipole: -0.027544 0.4850966 1.2194946 debye
polarizability: 141.66421|-4.5263855|119.6112135|-1.6571816|4.0277679|120.8957604 unknown
InChI: InChI=1S/C12H22O/c1-3-6-10(2)9-11-7-4-5-8-12(11)13/h10-11H,3-9H2,1-2H3
charge 0 multiplicity 1
35 atoms
O  -1.688101 -0.552738 -2.208784
C  -0.601322 -0.123884 -0.044842
C  0.525415 -1.055833 -0.54382
C  -1.219607 -0.558611 1.323227
C  1.746789 -1.202231 0.404946
C  -2.371305 0.369083 1.771159
C  -1.726047 0.019102 -1.085291
C  -3.485359 0.438208 0.703655
C  -2.912459 0.889721 -0.669437
C  2.391836 0.155997 0.808734
C  2.782454 -2.165928 -0.224893
C  2.913849 1.030776 -0.355766
C  3.556222 2.344132 0.142776
H  -0.194484 0.902494 0.10266
H  0.094381 -2.059532 -0.731127
H  0.865932 -0.697085 -1.534448
H  -0.423855 -0.572369 2.091386
H  -1.593524 -1.599116 1.230287
H  1.395763 -1.676818 1.347002
H  -1.973198 1.388874 1.9536
H  -2.788438 0.012939 2.732817
H  -4.285478 1.13467 1.018084
H  -3.952842 -0.560431 0.591705
H  -2.562737 1.939508 -0.579234
H  -3.677101 0.852232 -1.464359
H  3.235691 -0.051865 1.49989
H  1.661233 0.751854 1.39627
H  2.338809 -3.164707 -0.395058
H  3.139045 -1.793452 -1.203285
H  3.663571 -2.29212 0.432071
H  2.084086 1.271523 -1.049696
H  3.657841 0.463115 -0.947868
H  4.418887 2.137735 0.804275
H  2.830238 2.947751 0.720642
H  3.916715 2.964205 -0.698579
