program: Gaussian 09
title: 000292096
version: EM64L-G09RevD.01
frameworkgroup: C1[X(C13H11NO4)]
method: RPBEPBE
basis: SDD
operation: Freq
keyword: #p
keyword: freq=noraman
keyword: PBEPBE/SDD
title: #p freq=noraman PBEPBE/SDD
converged: YES YES NO NO
title: Mulliken charges:
elementType: O O O O N C C C C C C C C C C C C C H H H H H H H H H H H
charge: -0.252183 -0.286769 -0.202383 -0.221915 -0.108158 0.487568 -0.317806 0.035363 -0.569432 -0.399313 0.356827 -0.335686 -0.221471 0.238286 0.149320 -0.749041 0.262094 -0.747960 0.248972 0.260134 0.308564 0.309022 0.237773 0.256921 0.251643 0.251662 0.249065 0.254491 0.254413
chargesum: 0.00000
title: Mulliken charges with hydrogens summed into heavy atoms:
elementType: O O O O N C C C C C C C C C C C C C
charge: -0.252183 -0.286769 -0.202383 -0.221915 -0.108158 0.487568 -0.068834 0.035363 -0.309298 -0.090748 0.356827 -0.026663 0.016302 0.238286 0.149320 0.011184 0.262094 0.010009
polarizability: 3.45086913e+02 -1.11354562e+01 1.59938323e+02 -1.35795884e-01 -9.45831011e-02 7.30325576e+01
1716.lowfreq: -0.0009 -0.0008 -0.0005 2.5369 2.7769 5.6572 25.2162 37.7889 57.7331
frequency: 25.1887 37.7503 57.7313 64.2698 81.5010 92.3408 122.1691 156.2270 165.9237 172.7452 200.0336 229.4727 253.7978 304.9662 329.5200 336.6093 378.2418 399.2198 452.1594 504.5554 513.8531 553.2114 587.0814 599.6946 611.8156 620.3230 650.6790 701.8100 711.6790 726.7785 750.6700 759.2684 803.0171 823.8983 840.6398 898.2145 931.9329 953.8945 971.8278 974.7599 983.8424 998.1912 1015.8713 1024.5848 1041.0515 1046.4228 1101.3123 1124.3026 1145.0307 1174.5932 1202.3515 1221.0822 1249.1533 1324.6376 1350.2562 1386.2586 1395.2191 1398.9147 1435.6080 1449.9503 1451.9574 1453.7266 1453.8474 1476.7167 1557.7065 1571.9939 1611.7277 1649.9049 1663.5037 1687.4468 2998.4030 3009.6438 3077.9682 3097.6830 3107.0859 3133.5614 3146.0533 3148.2180 3150.8043 3172.4471 3211.3275
redmass: 7.9626 4.3117 4.6540 1.3193 5.1805 2.6525 1.1272 5.3357 3.6415 8.1737 9.7878 4.5646 4.7666 4.4237 3.7103 4.3519 6.1569 4.4761 3.0312 5.8646 4.9945 3.1048 4.2745 6.3698 6.6491 5.6393 6.6767 2.2339 6.8836 7.6847 8.8343 8.4713 10.5758 1.3371 6.5838 1.5081 4.5046 1.3447 1.5362 2.4394 5.8550 1.9958 1.3344 3.0235 1.6386 1.5165 1.8852 2.8695 2.5827 3.4638 1.1583 4.1443 2.3699 1.5993 1.8728 1.2442 4.4668 1.2676 2.6708 1.0441 1.0620 1.0473 1.0899 2.4310 5.8293 6.3879 6.4679 9.0798 9.7462 11.3858 1.0378 1.0369 1.0970 1.0973 1.0872 1.0991 1.1011 1.0899 1.0918 1.0969 1.0948
irintensity: 1.5992 0.4412 3.0688 0.9536 0.0505 2.0354 1.0683 10.2755 0.6423 0.0594 2.1949 2.6815 0.7799 0.4232 0.2486 4.4969 0.6580 0.7150 5.0694 2.4916 29.2405 0.8741 0.3245 6.4760 10.8716 2.6852 3.8727 30.6637 7.3457 10.7751 11.0405 5.6181 255.4779 45.7505 43.5426 10.0450 1.5067 4.7135 29.4107 21.4299 6.0996 173.9970 3.8980 104.7575 9.1983 6.0899 7.4203 69.4596 131.9972 634.2034 53.3538 90.6482 124.4729 19.4716 26.8997 60.5387 1.3519 18.2733 27.4906 18.6441 22.6705 20.1243 30.2805 46.8606 64.9459 49.5103 4.4063 337.2238 206.0202 153.1496 7.7973 0.9172 7.1668 5.9690 5.2143 5.5538 11.2351 12.2230 0.2941 26.1392 6.7526
temp: 298.150 k
press: 1.00000 atm
elementType: 8 8 8 8 7 6 6 6 6 6 6 6 6 6 6 6 6 6 1 1 1 1 1 1 1 1 1 1 1
symmnumber: 1
zpe: 557757.9 jmol-1
zpe.correction: 0.212439 hartree
zpe.thermalcorrener: 0.229120 hartree
zpe.thermalcorrenthalpy: 0.230064 hartree
zpe.thermalcorrgfe: 0.166146 hartree
zpe.sumelectzpe: -856.346698 hartree
zpe.sumelectthermal: -856.330017 hartree
zpe.sumelectthermalent: -856.329072 hartree
zpe.sumelectthermalfe: -856.392991 hartree
dipole: -0.8077 -3.7835 0.0563
dipole: 3.8692
quadrupole: -89.4199 -104.0239 -104.4187
quadrupole: 0.2678 -0.3425 0.1053
quadrupole: 9.8676 -4.7364 -5.1312 0.2678 -0.3425 0.1053
hfenergy: -856.5591368 hartree
pointgroup: C01 [X(C13H11N1O4)]
dipole: -0.1917625 0.8970958 -1.2147872 debye
polarizability: 345.0219755|-13.1348683|104.7214458|-4.1115686|-41.212064|128.3143731 unknown
InChI: InChI=1S/C13H11NO4/c1-8-14-12(13(16)17-8)7-10-4-3-5-11(6-10)18-9(2)15/h3-7H,1-2H3
charge 0 multiplicity 1
29 atoms
O  4.571342 -0.812803 0.74004
O  -3.534175 0.794079 -0.768961
O  2.673625 -1.573846 1.90167
O  -5.417637 0.050504 0.441508
N  3.603454 0.4868 -0.914708
C  -0.057748 -0.099485 0.150568
C  1.230338 0.262901 -0.430671
C  2.539302 -0.051405 -0.115222
C  -1.211788 0.448515 -0.485717
C  -0.246754 -0.947119 1.287959
C  -2.503027 0.162749 -0.007166
C  -2.695797 -0.675963 1.118036
C  -1.54831 -1.217665 1.746553
C  4.728263 0.036066 -0.402525
C  3.130704 -0.897041 0.96458
C  6.123356 0.290161 -0.850338
C  -4.921494 0.698984 -0.49999
C  -5.671242 1.503046 -1.53724
H  1.168781 0.925557 -1.306328
H  -1.110238 1.101281 -1.359519
H  0.618128 -1.380824 1.795546
H  -3.698375 -0.894297 1.486147
H  -1.685565 -1.867203 2.617487
H  6.110012 0.950318 -1.73005
H  6.629161 -0.657278 -1.109671
H  6.712317 0.764023 -0.044525
H  -6.748923 1.463485 -1.32452
H  -5.474888 1.097764 -2.545142
H  -5.324522 2.550592 -1.532201
