program: Gaussian 09
title: 000292157
version: EM64L-G09RevD.01
frameworkgroup: C1[X(C21H21NO5)]
method: RPBEPBE
basis: SDD
operation: Freq
keyword: #p
keyword: freq=noraman
keyword: PBEPBE/SDD
title: #p freq=noraman PBEPBE/SDD
converged: YES YES NO NO
title: Mulliken charges:
elementType: O O O O O N C C C C C C C C C C C C C C C C C C C C C H H H H H H H H H H H H H H H H H H H H H
charge: -0.279379 -0.269344 -0.199080 -0.207697 -0.438659 -0.086275 -0.564354 -0.290476 0.412824 0.448069 0.158465 0.209918 -0.154386 -0.421483 -0.451483 0.221342 0.238755 -0.374179 -0.366611 -0.245868 -0.243507 -0.245644 -0.254486 -0.259283 -0.266135 -0.665885 -0.665248 0.277216 0.296437 0.250730 0.252411 0.269684 0.300567 0.225992 0.229674 0.228500 0.231875 0.236016 0.224923 0.220065 0.239105 0.220663 0.217998 0.261362 0.208623 0.264895 0.227909 0.375444
chargesum: 0.00000
title: Mulliken charges with hydrogens summed into heavy atoms:
elementType: O O O O O N C C C C C C C C C C C C C C C C C C C C C
charge: -0.279379 -0.269344 -0.199080 -0.207697 -0.063215 -0.086275 -0.287138 0.005961 0.412824 0.448069 0.158465 0.209918 -0.154386 -0.170753 -0.199072 0.221342 0.238755 -0.104496 -0.066044 -0.019876 -0.013833 -0.017144 -0.022611 0.201656 0.193035 0.034138 0.036179
polarizability: 3.10526220e+02 -2.00341227e+01 2.35673007e+02 -9.60533239e+00 -4.41054580e+01 2.02949801e+02
1716.lowfreq: -10.3497 -6.1834 -0.0008 -0.0008 -0.0003 5.5023 10.4830 30.2468 33.6560
frequency: 10.3819 30.1986 33.6164 37.8357 47.8585 55.8047 67.6975 79.5667 93.6493 100.4420 105.4251 116.2429 122.9060 156.2639 185.6019 211.9800 216.8246 222.3993 234.2723 239.2806 256.1060 289.9774 300.3190 318.8816 330.6376 342.3755 366.8742 398.4504 406.1164 416.7967 438.0965 444.6909 460.5467 482.6954 506.8537 524.0604 563.7031 588.9549 603.6817 629.9406 646.0481 651.8467 661.4567 697.6467 711.7000 721.5120 747.5568 757.7636 764.8051 781.1764 788.4619 808.1351 814.2885 821.5665 836.8689 857.2759 870.7006 884.1569 889.9438 914.0456 942.4544 950.5531 960.8182 966.2022 983.7411 991.4041 996.2608 1014.1520 1022.3920 1040.2935 1049.9105 1084.5157 1091.7196 1095.6765 1098.9048 1102.8409 1139.2082 1155.2393 1156.3134 1164.9282 1174.3612 1179.8211 1190.0490 1205.5939 1216.5498 1228.6324 1268.1273 1277.5800 1279.8369 1281.9182 1286.7134 1322.7676 1331.2640 1345.2759 1357.1824 1360.5192 1385.4759 1389.6954 1393.4694 1393.7634 1435.8895 1449.5567 1455.7168 1457.1587 1464.0816 1465.2282 1474.5205 1482.3657 1484.6619 1485.6184 1548.4808 1576.1914 1596.7169 1608.4708 1618.0155 1635.9704 1661.9944 2992.0085 2992.1178 3016.0396 3024.4455 3029.4336 3029.6103 3083.9453 3085.8468 3094.6326 3095.1051 3113.5307 3119.6727 3119.8817 3127.5229 3135.4701 3143.6210 3157.4451 3158.1978 3172.4133 3206.5336 3560.3515
redmass: 4.6000 4.8211 4.3359 4.3027 4.0122 3.8268 5.0546 5.0446 4.7082 3.7915 4.3443 3.9903 4.2781 4.7482 3.1141 1.7123 3.8122 2.5226 4.6205 1.9008 5.0697 2.7541 4.6942 3.2673 4.5211 5.7827 5.7639 3.8312 5.2638 3.3234 4.3275 3.2880 1.9248 1.9946 5.2220 4.3692 4.8389 5.9348 6.0009 5.3509 5.2573 5.4408 4.7250 5.6242 3.2436 4.1283 3.8837 2.6791 1.2604 3.0604 1.9763 1.4692 1.5106 3.0394 3.1858 5.1247 3.2441 1.7967 1.5813 4.6282 3.4658 4.3226 1.5610 1.5433 3.7257 1.3381 1.3337 2.9165 3.8426 2.4188 2.0984 2.4213 2.3204 2.1789 2.2400 2.4811 4.9853 1.6539 1.7322 1.7355 1.0621 1.1575 1.7509 1.9584 1.3122 1.5759 1.4084 1.1220 1.4893 1.1181 1.4381 2.4305 1.7133 1.7789 1.2589 1.4510 4.4630 7.6023 1.2329 1.2333 2.2960 2.7507 1.0944 1.0891 1.0474 1.0448 2.3817 1.4384 1.0568 1.5744 5.8123 6.4607 7.6561 6.1759 6.6271 9.5809 10.1460 1.0368 1.0363 1.0831 1.0823 1.0595 1.0596 1.0977 1.0971 1.1038 1.1030 1.0883 1.1059 1.1052 1.0853 1.0896 1.0902 1.0959 1.0983 1.0978 1.0941 1.0673
irintensity: 0.1808 0.6536 0.1008 1.3693 0.1498 0.3819 2.0970 0.8377 0.2411 0.3267 2.1895 0.8402 0.7708 0.8705 0.1676 2.4523 0.4323 1.9330 1.7189 0.2737 1.3901 4.2888 3.1786 2.9168 14.5306 4.3352 1.8179 14.5508 0.7438 28.0167 10.1497 10.4027 48.3458 34.5108 1.4620 6.1212 14.0606 22.5899 1.0855 7.0908 27.1688 4.9835 32.2302 4.0126 29.7614 13.7487 6.3525 14.6668 3.7135 21.9053 69.3269 3.3113 10.5338 4.3951 0.0788 12.7289 91.1909 27.9534 2.7018 8.7940 45.9510 8.2266 7.7230 7.9223 1.6050 0.4400 0.6886 14.7711 244.2403 11.2873 12.5393 261.5347 24.5403 35.7708 23.0983 8.2561 151.9780 7.6434 15.2626 33.8530 0.8530 0.8210 36.6556 1.4882 3.3244 22.8059 12.8969 1.8729 50.1619 1.3671 69.5550 38.7922 30.1135 4.2757 2.0265 12.7816 2.7324 0.6149 23.5640 12.9406 13.4254 1.7512 12.1165 12.6110 15.0489 16.1292 20.9986 13.8319 18.7189 13.7409 2.5220 0.0293 1.3940 5.9123 1.9361 116.2251 145.2042 24.8011 8.3325 2.7700 6.7085 22.2773 43.3881 48.9252 37.4550 1.4347 4.1647 7.1634 27.3525 25.3905 1.7461 12.1562 15.9702 26.7307 26.7159 17.0124 5.6481 69.2175
temp: 298.150 k
press: 1.00000 atm
elementType: 8 8 8 8 8 7 6 6 6 6 6 6 6 6 6 6 6 6 6 6 6 6 6 6 6 6 6 1 1 1 1 1 1 1 1 1 1 1 1 1 1 1 1 1 1 1 1 1
symmnumber: 1
zpe: 986318.3 jmol-1
zpe.correction: 0.375669 hartree
zpe.thermalcorrener: 0.401230 hartree
zpe.thermalcorrenthalpy: 0.402175 hartree
zpe.thermalcorrgfe: 0.317724 hartree
zpe.sumelectzpe: -1241.724481 hartree
zpe.sumelectthermal: -1241.698920 hartree
zpe.sumelectthermalent: -1241.697975 hartree
zpe.sumelectthermalfe: -1241.782426 hartree
dipole: -0.0777 -1.3791 2.2911
dipole: 2.6753
quadrupole: -126.6119 -148.1050 -156.2224
quadrupole: -2.0399 -13.9667 -5.8461
quadrupole: 17.0345 -4.4586 -12.5760 -2.0399 -13.9667 -5.8461
hfenergy: -1242.1001499 hartree
pointgroup: C01[X(C21H21N1O5)]
dipole: 0.0366723 0.7752386 -0.7109875 debye
polarizability: 312.8451956|11.8563224|254.6016228|12.8118535|-29.2876545|181.7022095 unknown
InChI: InChI=1S/C21H21NO5/c1-3-26-20(23)18(21(24)27-4-2)17-13-9-5-7-11-15(13)19(22-25)16-12-8-6-10-14(16)17/h5-12,17-18,25H,3-4H2,1-2H3
charge 0 multiplicity 1
48 atoms
O  -3.048639 1.838953 -0.537891
O  0.752272 2.051608 1.952225
O  -2.854221 1.344578 1.733719
O  -0.086111 -0.125843 2.09152
O  3.826765 -1.7305 0.445487
N  2.443754 -2.197195 0.310166
C  -0.496575 0.518131 -0.995034
C  -0.832833 1.403586 0.285481
C  -0.785671 -0.965713 -0.824823
C  0.943444 0.790581 -1.416348
C  0.261212 -1.879328 -0.524882
C  2.004758 -0.103772 -1.076926
C  1.665452 -1.385557 -0.400686
C  -2.10667 -1.45154 -0.975342
C  1.228655 1.981115 -2.124146
C  -2.329252 1.48262 0.61042
C  -0.045606 0.986147 1.528489
C  -0.039996 -3.258146 -0.363163
C  3.3347 0.236589 -1.464479
C  -2.400912 -2.819718 -0.809842
C  2.545844 2.30512 -2.506758
C  -1.359921 -3.726308 -0.496296
C  3.600468 1.424345 -2.172763
C  -4.514765 2.089957 -0.345833
C  1.619399 1.799608 3.148587
C  -5.31913 0.789367 -0.411649
C  2.982442 1.253358 2.716026
H  -1.172771 0.919903 -1.77221
H  -0.525798 2.435629 0.03151
H  -2.905342 -0.747189 -1.230117
H  0.403943 2.656086 -2.385241
H  0.776924 -3.947941 -0.134789
H  4.150555 -0.4393 -1.210013
H  -3.428623 -3.17934 -0.932172
H  2.747691 3.2274 -3.062412
H  -1.577333 -4.792531 -0.369703
H  4.628896 1.660967 -2.466877
H  -4.652827 2.593334 0.627253
H  -4.765058 2.77669 -1.170129
H  1.698811 2.791015 3.622838
H  1.092254 1.096005 3.81656
H  -6.396182 1.019358 -0.311034
H  -5.170295 0.27433 -1.376892
H  -5.035032 0.110866 0.409697
H  3.637716 1.155324 3.602077
H  2.885515 0.261001 2.245768
H  3.47085 1.934474 1.997982
H  4.20424 -2.416624 1.053744
