program: Gaussian 09
title: 000292080
version: EM64L-G09RevD.01
frameworkgroup: C1[X(C14H12N2O2)]
method: RPBEPBE
basis: SDD
operation: Freq
keyword: #p
keyword: freq=noraman
keyword: PBEPBE/SDD
title: #p freq=noraman PBEPBE/SDD
converged: YES YES NO NO
title: Mulliken charges:
elementType: O O N N C C C C C C C C C C C C C C H H H H H H H H H H H H
charge: -0.206829 -0.196821 -0.064096 0.020570 0.477744 0.438385 0.239980 -0.488536 -0.382616 -0.362875 -0.330026 -0.360776 0.379494 -0.382789 -0.377045 -0.364099 -0.194049 -0.805243 0.326470 0.231144 0.234924 0.234361 0.256545 0.237944 0.214589 0.289424 0.240743 0.228288 0.238405 0.226791
chargesum: 0.00000
title: Mulliken charges with hydrogens summed into heavy atoms:
elementType: O O N N C C C C C C C C C C C C C C
charge: -0.206829 -0.196821 -0.064096 0.020570 0.477744 0.438385 0.239980 -0.162065 -0.151472 -0.127951 -0.095665 -0.104231 0.379494 -0.144846 -0.162456 -0.074675 0.046694 -0.111759
polarizability: 3.69662941e+02 -2.22783590e+01 1.81958016e+02 2.51648625e+00 6.71672649e+00 7.78342741e+01
1716.lowfreq: -6.8387 -4.7560 -3.2485 -0.0008 0.0003 0.0007 26.1332 38.6005 39.2735
frequency: 26.1132 38.5611 39.1325 43.9229 59.8162 104.6369 142.7164 159.9949 192.5267 225.6680 263.5940 288.1634 338.0029 363.3530 380.4666 410.1213 428.7187 459.5525 488.6495 503.1999 524.1233 547.2723 616.6841 635.3869 660.9878 687.2222 703.6110 721.3639 749.7549 772.6882 816.1360 824.5585 837.3546 843.9448 928.8512 931.8144 950.6013 965.7535 975.0174 984.2759 987.0694 989.6046 1002.1096 1005.0316 1045.7956 1072.3205 1086.4099 1119.6889 1162.8837 1174.9823 1194.2113 1215.8479 1223.2450 1244.3845 1273.6176 1301.6884 1349.7707 1368.9207 1375.7582 1398.4965 1404.5671 1414.6622 1435.4067 1469.6273 1473.7747 1475.4884 1497.8923 1564.8464 1572.5204 1593.8237 1615.0452 1626.6120 2953.3524 2974.8208 3056.0649 3086.7834 3117.2660 3128.5235 3129.5289 3140.8902 3160.0669 3163.9418 3182.8890 3188.3125
redmass: 3.9508 4.3435 1.1257 6.5322 6.5329 4.8412 5.4878 4.4873 4.5697 7.9893 2.8968 4.0884 3.3614 4.9592 6.6808 2.9213 3.3017 6.0731 4.6025 4.3489 4.9456 3.6197 5.8057 6.8828 7.9069 2.3354 4.6769 3.0151 5.9625 6.2117 1.4941 1.5911 3.2992 1.5400 3.3535 1.4410 1.3810 1.4330 1.3725 1.5495 5.7667 1.4740 1.3916 2.7338 1.5609 1.7241 1.7683 1.2762 2.0753 1.1439 1.5836 6.2412 2.8705 2.5729 1.3347 1.3108 2.3761 3.2161 11.6721 1.2244 4.1311 3.4784 2.8498 1.1061 1.0560 2.8712 2.7766 6.2746 6.4287 6.2620 7.0289 6.5751 1.0861 1.0391 1.0943 1.0999 1.0870 1.0893 1.0893 1.0964 1.0930 1.0959 1.0921 1.0963
irintensity: 0.5154 0.3081 0.4950 0.1521 1.2461 1.2649 0.8597 1.8822 3.8945 3.0921 11.3117 1.6383 2.1766 7.6266 2.8912 3.8288 0.9644 7.6153 8.2773 2.6802 1.1629 20.6746 5.7018 0.7584 19.7725 26.0223 22.9385 2.5297 13.1130 9.6452 10.6003 59.3527 0.9021 28.6743 4.1475 1.5653 1.8200 0.7243 4.6701 18.4182 0.1352 11.0653 3.2850 4.3740 24.0023 40.8352 16.2208 13.4197 0.2145 15.6541 31.3140 225.7730 11.0056 21.4677 2.1023 0.4060 3.4694 4.5728 105.6184 9.2189 1.1961 2.5222 10.1873 12.8864 13.0065 14.6033 53.3157 2.6477 0.5606 13.8767 5.4915 21.4337 57.2891 39.3886 23.7625 16.8980 14.3360 23.7457 7.4762 19.8850 18.3163 6.3676 5.6382 5.3528
temp: 298.150 k
press: 1.00000 atm
elementType: 8 8 7 7 6 6 6 6 6 6 6 6 6 6 6 6 6 6 1 1 1 1 1 1 1 1 1 1 1 1
symmnumber: 1
zpe: 596056.4 jmol-1
zpe.correction: 0.227026 hartree
zpe.thermalcorrener: 0.242822 hartree
zpe.thermalcorrenthalpy: 0.243766 hartree
zpe.thermalcorrgfe: 0.181033 hartree
zpe.sumelectzpe: -799.291991 hartree
zpe.sumelectthermal: -799.276195 hartree
zpe.sumelectthermalent: -799.275251 hartree
zpe.sumelectthermalfe: -799.337984 hartree
dipole: 4.4193 5.3479 -0.5564
dipole: 6.9599
quadrupole: -101.5087 -99.6825 -107.0114
quadrupole: -18.7260 2.0069 3.1817
quadrupole: 1.2255 3.0517 -4.2772 -18.7260 2.0069 3.1817
hfenergy: -799.5190172 hartree
pointgroup: C01 [X(C14H12N2O2)]
dipole: 1.7137455 1.9542256 0.8614361 debye
polarizability: 369.8901226|-22.4865795|152.9119215|0.0829871|46.5089303|106.6531863 unknown
InChI: InChI=1S/C14H12N2O2/c1-11-5-7-13(8-6-11)15-10-12-3-2-4-14(9-12)16(17)18/h2-10H,1H3
charge 0 multiplicity 1
30 atoms
O  -5.469383 -1.262493 -0.792688
O  -3.492724 -2.324809 -1.193075
N  0.846171 -0.012295 -0.165182
N  -4.178637 -1.31181 -0.786212
C  -1.334845 0.983611 0.224523
C  5.122237 -0.25059 -0.051441
C  2.263891 -0.039383 -0.086742
C  -2.036821 -0.152369 -0.259393
C  4.433526 0.528386 0.916757
C  4.349188 -0.941954 -1.022117
C  3.029852 0.642131 0.903676
C  2.944322 -0.852301 -1.033409
C  -3.440778 -0.122589 -0.276624
C  -2.071335 2.112677 0.677507
C  0.13997 1.004278 0.260881
C  -4.187587 0.993202 0.170972
C  -3.483505 2.115788 0.650741
C  6.637296 -0.339898 -0.050012
H  -1.481536 -1.026348 -0.609774
H  5.008222 1.041811 1.697346
H  4.855639 -1.567027 -1.767202
H  2.526567 1.221864 1.686575
H  2.345306 -1.399073 -1.768505
H  -1.530965 2.991057 1.051206
H  0.59736 1.940284 0.645994
H  -5.279394 0.961011 0.135653
H  -4.035873 2.992616 1.002898
H  6.986895 -1.309173 -0.446831
H  7.081429 0.452569 -0.684017
H  7.051413 -0.215774 0.965993
