program: Gaussian 09
title: 000292079
version: EM64L-G09RevD.01
frameworkgroup: C1[X(C13H8Cl2N2O2)]
method: RPBEPBE
basis: SDD
operation: Freq
keyword: #p
keyword: freq=noraman
keyword: PBEPBE/SDD
title: #p freq=noraman PBEPBE/SDD
converged: YES YES NO NO
title: Mulliken charges:
elementType: Cl Cl O O N N C C C C C C C C C C C C C H H H H H H H H
charge: -0.036369 -0.036321 -0.202582 -0.194389 -0.058739 0.021367 0.482508 -0.481610 0.380527 -0.376564 0.353094 -0.367953 -0.358200 -0.192687 -0.254938 -0.330230 -0.197711 -0.202842 -0.109586 0.326091 0.243015 0.246194 0.291626 0.244351 0.265691 0.282076 0.264179
chargesum: 0.00000
title: Mulliken charges with hydrogens summed into heavy atoms:
elementType: Cl Cl O O N N C C C C C C C C C C C C C
charge: -0.036369 -0.036321 -0.202582 -0.194389 -0.058739 0.021367 0.482508 -0.155519 0.380527 -0.133549 0.353094 -0.121758 -0.066573 0.051664 -0.254938 -0.064539 0.084365 0.061337 -0.109586
polarizability: 3.67956346e+02 2.80514012e+01 1.83215142e+02 -3.28633343e+00 -2.67801973e+00 8.78009554e+01
1716.lowfreq: -3.9970 0.0015 0.0018 0.0025 2.3900 3.8460 19.0800 31.5857 37.8970
frequency: 19.0384 31.5762 37.8951 55.7544 85.7850 132.6623 154.5443 160.9565 171.6604 188.6124 217.0862 253.0776 284.2948 323.4771 363.9997 369.9356 384.1615 425.4788 428.6644 448.7827 486.8293 509.3495 545.4280 557.2833 589.5774 648.7004 659.1899 683.9982 695.9884 704.4676 714.6748 768.2407 817.4496 824.5878 835.5978 861.5466 926.8116 936.3837 955.3216 969.0652 987.9636 992.5415 1005.4713 1021.3945 1074.4114 1082.0319 1087.8604 1132.5635 1175.4696 1178.2295 1215.5704 1237.9448 1248.9710 1275.1180 1334.8963 1360.7665 1377.2705 1385.8026 1409.1141 1436.2898 1449.6069 1480.7128 1547.1665 1575.8417 1583.7078 1612.7112 1625.4516 3007.3098 3133.6763 3162.1721 3162.9225 3181.6530 3182.6560 3184.0037 3188.2124
redmass: 9.9879 10.0238 9.2187 11.1874 8.4884 6.8700 5.4520 6.4189 6.3949 12.4589 10.0975 4.8747 4.0280 6.8336 7.2061 11.3511 7.5561 6.4706 3.4717 3.7975 6.4125 5.7822 5.3439 4.2420 6.3802 7.4846 7.9598 2.8004 3.3323 6.4793 5.9825 8.5902 1.5019 1.5740 4.8371 1.3906 4.1775 1.3768 1.3554 1.4136 6.1202 1.6139 1.3954 4.1517 1.7318 2.5216 1.7653 1.3997 1.4102 2.2272 6.9462 1.6903 1.7453 1.3329 3.9077 2.2640 11.2787 4.5062 3.5991 2.7533 2.5164 3.1935 8.3861 7.2086 6.9161 6.8679 7.3996 1.0887 1.0896 1.0887 1.0928 1.0948 1.0922 1.0961 1.0967
irintensity: 1.6372 0.4219 0.4260 0.5493 0.0524 0.6356 5.3895 0.2225 1.3944 2.2512 7.4598 12.1748 8.9058 0.6155 5.3586 6.8599 3.8941 12.1070 2.9405 6.7679 6.2587 11.1253 1.8664 12.8158 2.6641 2.1656 20.0391 23.2911 51.6478 16.1533 29.0473 17.7751 7.4190 61.5788 12.3924 22.4974 8.6215 3.0918 0.5487 6.4114 0.6125 22.7674 3.8854 60.1677 44.1183 56.3636 17.2002 2.1413 4.4115 74.0171 222.4290 11.4708 12.6840 3.0962 9.2344 5.0594 105.8487 12.0814 6.1593 23.6382 73.4301 52.3749 14.6938 5.6900 31.6798 23.8389 89.9962 29.4631 5.8841 1.1529 14.2336 0.2020 5.7598 2.1196 5.3203
temp: 298.150 k
press: 1.00000 atm
elementType: 17 17 8 8 7 7 6 6 6 6 6 6 6 6 6 6 6 6 6 1 1 1 1 1 1 1 1
symmnumber: 1
zpe: 474471.4 jmol-1
zpe.correction: 0.180717 hartree
zpe.thermalcorrener: 0.197257 hartree
zpe.thermalcorrenthalpy: 0.198201 hartree
zpe.thermalcorrgfe: 0.133429 hartree
zpe.sumelectzpe: -1678.835926 hartree
zpe.sumelectthermal: -1678.819385 hartree
zpe.sumelectthermalent: -1678.818441 hartree
zpe.sumelectthermalfe: -1678.883213 hartree
dipole: -1.0704 4.0321 -2.8178
dipole: 5.0343
quadrupole: -141.1685 -119.8036 -123.6626
quadrupole: 21.8081 -7.4504 1.6136
quadrupole: -12.9569 8.4080 4.5489 21.8081 -7.4504 1.6136
hfenergy: -1679.0166422 hartree
pointgroup: C01 [X(C13H8Cl2N2O2)]
dipole: 0.4403657 1.9166285 -0.2356031 debye
polarizability: 368.0296707|-27.8887068|144.6823268|7.3661677|-46.3345406|126.2604462 unknown
InChI: InChI=1S/C13H8Cl2N2O2/c14-10-4-5-13(12(15)7-10)16-8-9-2-1-3-11(6-9)17(18)19/h1-8H
charge 0 multiplicity 1
27 atoms
Cl 2.284417 1.014582 -2.407415
Cl 6.763628 -0.590454 0.399559
O  -5.587007 -1.271436 0.730263
O  -3.613411 -2.33982 1.13261
N  0.729445 0.023903 0.265869
N  -4.296975 -1.316934 0.748169
C  -1.445965 1.022349 -0.126159
C  -2.150156 -0.133115 0.302558
C  -3.554098 -0.107767 0.295803
C  -2.174667 2.166362 -0.551292
C  2.139934 -0.036157 0.231228
C  0.029647 1.051446 -0.140151
C  -4.294624 1.022769 -0.123935
C  -3.587006 2.164796 -0.549687
C  2.983514 0.347213 -0.854981
C  2.778897 -0.626892 1.361237
C  4.379926 0.170074 -0.820991
C  4.174354 -0.782696 1.437576
C  4.959188 -0.378477 0.33863
H  -1.600693 -1.020026 0.629078
H  -1.629635 3.057499 -0.885228
H  0.490262 1.995112 -0.487797
H  -5.386936 0.9864 -0.109844
H  -4.136312 3.051761 -0.879908
H  2.136353 -0.958305 2.182177
H  4.995858 0.456363 -1.676788
H  4.639562 -1.223351 2.323122
