program: Gaussian 09
title: 000292082
version: EM64L-G09RevD.01
frameworkgroup: C1[X(C14H11ClN2O2)]
method: RPBEPBE
basis: SDD
operation: Freq
keyword: #p
keyword: freq=noraman
keyword: PBEPBE/SDD
title: #p freq=noraman PBEPBE/SDD
converged: YES YES NO NO
title: Mulliken charges:
elementType: Cl O O N N C C C C C C C C C C C C C C H H H H H H H H H H H
charge: -0.061367 -0.201126 -0.202380 -0.074888 0.022531 0.319354 0.143886 0.474413 -0.366834 -0.309342 -0.491739 -0.799190 0.370400 -0.372696 -0.376759 -0.243725 -0.106290 -0.356886 -0.182667 0.241431 0.270351 0.287797 0.238464 0.249536 0.220022 0.233070 0.281924 0.258368 0.290607 0.243734
chargesum: 0.00000
title: Mulliken charges with hydrogens summed into heavy atoms:
elementType: Cl O O N N C C C C C C C C C C C C C C
charge: -0.061367 -0.201126 -0.202380 -0.074888 0.022531 0.319354 0.143886 0.474413 -0.125403 -0.038991 -0.203942 -0.091167 0.370400 -0.139626 -0.094835 0.014643 -0.106290 -0.066279 0.061067
polarizability: 3.58180107e+02 1.67857574e+00 1.99958637e+02 -1.09321612e+01 -9.37427766e+00 9.00034695e+01
1716.lowfreq: -6.5690 0.0015 0.0020 0.0025 2.1164 4.3323 19.8580 37.3109 44.8901
frequency: 19.8355 37.2938 44.8780 63.2609 89.7029 111.4816 120.4489 134.9172 170.1459 177.7795 232.5011 258.1851 272.5075 287.1608 325.5347 354.3708 363.3582 403.9717 423.9468 452.3569 483.0981 510.2011 522.3418 557.3366 583.3613 632.5575 641.1473 673.4914 686.0463 701.1860 717.8817 754.5994 793.4616 812.7967 827.9013 860.2564 876.9333 901.5488 926.4671 947.5065 963.5936 984.8723 987.6694 989.3230 1013.1839 1045.5617 1079.5678 1081.3898 1088.9024 1122.1453 1169.0035 1176.1400 1207.7431 1216.1233 1241.7887 1269.4842 1294.6929 1347.2485 1362.6742 1373.3557 1382.0418 1398.2482 1412.4227 1435.8587 1451.5272 1468.9157 1475.6814 1480.6069 1562.3780 1576.1005 1586.9824 1610.7140 1621.1892 2960.7927 2982.4954 3061.4372 3095.6241 3137.2391 3150.7600 3159.4650 3160.6583 3169.7008 3175.8256 3187.1808
redmass: 6.3397 8.2757 7.2657 6.5500 1.2247 2.7016 5.4179 6.9355 5.7979 4.9344 4.6866 6.5991 3.6556 4.1577 4.1456 9.3815 5.9129 6.0249 3.1504 2.9969 4.5834 7.1433 4.9193 5.6177 5.0225 6.7702 6.9920 7.6210 2.5137 4.3039 3.4589 6.8528 5.5425 1.2910 1.4467 1.6642 5.2542 3.9252 1.4493 1.3421 1.3796 1.6636 5.2142 1.5816 1.3783 1.5442 1.8214 2.0031 1.6210 2.0095 1.1800 2.0005 3.2715 4.9089 2.2817 1.3710 1.5146 1.7954 4.6040 8.9550 4.4169 1.2537 4.2178 3.1081 1.0710 2.5763 1.1104 3.0394 7.4793 7.1073 6.2696 6.5671 7.2091 1.0870 1.0377 1.0950 1.1004 1.0898 1.0880 1.0919 1.0921 1.0945 1.0956 1.0968
irintensity: 0.7982 0.2115 0.5488 0.3874 0.6204 0.8207 6.5736 3.7783 0.2331 0.6168 6.8677 0.3587 8.1241 4.8141 0.2445 4.0901 2.4595 1.2291 0.5161 7.3340 8.1564 4.7060 17.7680 7.4004 2.6141 15.5128 1.9407 22.6878 18.1842 27.0741 1.1838 12.6010 1.8084 35.6116 30.4742 42.8184 74.1396 3.7594 8.3284 0.3333 4.0606 22.4480 1.3843 10.8839 1.9883 14.4835 34.6883 3.4777 33.2915 23.3292 33.7323 2.7649 63.0979 200.7297 40.4292 2.9944 7.3729 8.9175 0.3234 95.5173 19.0664 19.3716 6.2499 19.5943 17.5941 29.4409 18.1405 69.5796 17.7936 16.7500 33.6971 4.7976 12.0858 36.7343 23.0045 16.1377 23.2586 17.0172 6.0697 0.6740 2.7327 7.9758 3.6734 4.0621
temp: 298.150 k
press: 1.00000 atm
elementType: 17 8 8 7 7 6 6 6 6 6 6 6 6 6 6 6 6 6 6 1 1 1 1 1 1 1 1 1 1 1
symmnumber: 1
zpe: 571049.8 jmol-1
zpe.correction: 0.217501 hartree
zpe.thermalcorrener: 0.234487 hartree
zpe.thermalcorrenthalpy: 0.235431 hartree
zpe.thermalcorrgfe: 0.170207 hartree
zpe.sumelectzpe: -1258.682493 hartree
zpe.sumelectthermal: -1258.665508 hartree
zpe.sumelectthermalent: -1258.664564 hartree
zpe.sumelectthermalfe: -1258.729788 hartree
dipole: -2.4884 4.5688 -0.3721
dipole: 5.2158
quadrupole: -137.6501 -115.7845 -118.4850
quadrupole: 7.5259 -10.6456 0.7420
quadrupole: -13.6769 8.1887 5.4882 7.5259 -10.6456 0.7420
hfenergy: -1258.8999948 hartree
pointgroup: C01 [X(C14H11Cl1N2O2)]
dipole: 1.0178122 -1.771658 0.1903123 debye
polarizability: 356.0004271|7.9597548|200.4593479|24.867493|-7.3505179|91.6824387 unknown
InChI: InChI=1S/C14H11ClN2O2/c1-10-5-6-12(15)8-14(10)16-9-11-3-2-4-13(7-11)17(18)19/h2-9H,1H3
charge 0 multiplicity 1
30 atoms
Cl 4.808879 2.905003 -0.671922
O  -6.050244 1.022079 -0.360767
O  -4.508364 2.569216 0.294964
N  0.985932 -0.655181 0.023302
N  -4.839588 1.386596 -0.102685
C  3.23143 -1.227782 0.793636
C  2.338918 -0.271647 0.209464
C  -1.394768 -0.192497 -0.157836
C  4.592231 -0.869501 0.93518
C  2.827519 0.991845 -0.234592
C  -2.430024 0.761203 0.00356
C  2.715016 -2.568929 1.269494
C  -3.757766 0.380921 -0.2741
C  -0.001298 0.197398 0.129756
C  -1.721138 -1.508474 -0.596444
C  5.09012 0.382461 0.504698
C  4.188533 1.291905 -0.079295
C  -4.096649 -0.918467 -0.70803
C  -3.05739 -1.863264 -0.866245
H  5.286155 -1.58784 1.38589
H  2.159005 1.701549 -0.731515
H  -2.223207 1.782811 0.33846
H  2.118963 -2.464312 2.195864
H  2.04346 -3.016047 0.515622
H  3.545156 -3.265201 1.476778
H  0.151413 1.245921 0.461872
H  -0.904237 -2.226903 -0.716331
H  6.149281 0.634143 0.6068
H  -5.142383 -1.163401 -0.911341
H  -3.297153 -2.876905 -1.202538
