program: Gaussian 09
title: 000292081
version: EM64L-G09RevD.01
frameworkgroup: C1[X(C14H12N2O2)]
method: RPBEPBE
basis: SDD
operation: Freq
keyword: #p
keyword: freq=noraman
keyword: PBEPBE/SDD
title: #p freq=noraman PBEPBE/SDD
converged: YES YES NO NO
title: Mulliken charges:
elementType: O O N N C C C C C C C C C C C C C C H H H H H H H H H H H H
charge: -0.206319 -0.196415 -0.072092 0.020697 0.466697 0.478810 0.271208 -0.531825 -0.487450 0.379501 -0.399130 -0.362476 -0.382302 -0.379145 -0.207793 -0.363158 -0.194121 -0.803984 0.259967 0.326733 0.234480 0.238721 0.239643 0.218894 0.226168 0.289695 0.241231 0.231280 0.237560 0.224922
chargesum: 0.00000
title: Mulliken charges with hydrogens summed into heavy atoms:
elementType: O O N N C C C C C C C C C C C C C C
charge: -0.206319 -0.196415 -0.072092 0.020697 0.466697 0.478810 0.271208 -0.271859 -0.160717 0.379501 -0.164650 -0.122832 -0.143581 -0.160250 0.018375 -0.073462 0.047109 -0.110221
polarizability: 3.45897733e+02 1.67142940e+01 1.86518180e+02 -8.18539171e+00 2.48597608e+00 8.10994557e+01
1716.lowfreq: -2.1512 -1.9986 -0.0006 0.0004 0.0008 4.8002 23.0966 31.1208 41.1942
frequency: 23.0750 31.0872 41.1909 47.5365 62.5133 119.8598 144.3862 163.2559 210.1800 224.8767 252.7737 264.3260 300.8345 359.1202 381.8091 428.1987 440.7576 468.6080 504.9245 511.4457 529.9424 543.9890 580.1403 641.8732 665.3253 686.6138 698.2739 706.1394 740.3609 773.8172 795.7144 819.0776 886.1390 911.9108 918.4486 930.6237 935.5813 967.4644 976.0927 984.4237 987.3201 989.6648 1001.3068 1003.3007 1048.7937 1072.8870 1086.7020 1099.2208 1142.8615 1175.0110 1181.5800 1210.6460 1226.1442 1254.9182 1273.8888 1298.1851 1355.0415 1376.1353 1379.4722 1397.5018 1404.1943 1427.4817 1436.1437 1468.6680 1473.9013 1474.4091 1482.5337 1571.1423 1579.2178 1595.5086 1615.3816 1624.7843 2954.1818 2977.2205 3059.3194 3088.1750 3121.8555 3130.2201 3134.5672 3145.1173 3155.5504 3160.3694 3182.7512 3188.4243
redmass: 4.2708 1.0293 8.2291 6.3295 6.2890 4.7977 5.5071 4.9141 3.1363 6.7190 3.3959 3.6709 4.3332 4.3332 6.5616 3.2134 2.9640 5.6520 5.1174 5.2579 4.8818 6.6475 4.0580 6.9248 7.5697 2.3617 2.0416 4.4772 7.3930 4.3667 1.8000 1.5013 1.3221 1.5171 2.9972 2.5673 1.6491 1.4557 1.3738 2.9460 6.1752 2.0595 1.4814 1.4336 1.5665 1.7195 1.7562 1.5714 1.8951 1.1384 1.1071 4.8368 4.0580 2.6780 1.3372 1.3403 1.9570 11.4924 5.8718 1.2258 4.2362 2.5118 2.8270 2.1854 1.1573 1.3176 2.3032 6.6119 5.6124 6.4415 7.0179 6.6034 1.0863 1.0386 1.0951 1.0999 1.0856 1.0893 1.0914 1.0923 1.0993 1.0931 1.0921 1.0963
irintensity: 0.7139 0.5880 0.0478 0.3917 1.5194 2.8672 0.8584 0.8255 2.9451 1.6341 16.0388 3.0481 0.1720 1.0137 1.4167 1.0020 5.0542 5.1035 14.7036 0.9242 2.6586 8.1024 1.4558 0.2473 21.3407 7.3572 65.0760 2.9132 11.0088 23.4373 27.4811 38.4266 4.1046 8.7575 12.9307 5.2642 3.0644 1.5994 1.0740 12.7978 0.1299 16.5066 4.5056 6.3971 18.8496 41.7279 17.7188 8.0106 1.9589 16.9128 1.0244 174.6035 89.6950 7.6930 2.1889 0.7965 2.5045 109.4663 0.6046 13.5689 0.3500 2.1014 10.2533 7.5174 14.4144 5.7975 53.4099 16.0024 7.4671 20.7366 14.3300 2.3727 53.7171 34.9651 21.7281 16.6741 1.7424 7.8654 18.8163 9.2776 25.0650 17.2118 5.8565 5.2095
temp: 298.150 k
press: 1.00000 atm
elementType: 8 8 7 7 6 6 6 6 6 6 6 6 6 6 6 6 6 6 1 1 1 1 1 1 1 1 1 1 1 1
symmnumber: 1
zpe: 596245.2 jmol-1
zpe.correction: 0.227098 hartree
zpe.thermalcorrener: 0.242890 hartree
zpe.thermalcorrenthalpy: 0.243834 hartree
zpe.thermalcorrgfe: 0.181010 hartree
zpe.sumelectzpe: -799.291939 hartree
zpe.sumelectthermal: -799.276147 hartree
zpe.sumelectthermalent: -799.275203 hartree
zpe.sumelectthermalfe: -799.338027 hartree
dipole: 3.5666 -5.1844 1.1307
dipole: 6.3935
quadrupole: -102.1307 -99.5856 -106.9142
quadrupole: 19.5801 -3.0009 3.1417
quadrupole: 0.7461 3.2913 -4.0374 19.5801 -3.0009 3.1417
hfenergy: -799.5190364 hartree
pointgroup: C01 [X(C14H12N2O2)]
dipole: 1.3886097 1.875735 0.9383793 debye
polarizability: 345.7998343|-20.2222515|144.2990763|1.6496902|51.2922933|123.4164579 unknown
InChI: InChI=1S/C14H12N2O2/c1-11-4-2-6-13(8-11)15-10-12-5-3-7-14(9-12)16(17)18/h2-10H,1H3
charge 0 multiplicity 1
30 atoms
O  -5.274032 -1.285973 -1.088188
O  -3.240009 -2.242702 -1.466258
N  0.950061 0.130935 -0.033129
N  -3.984293 -1.289584 -1.019725
C  4.543089 -0.537388 -0.808052
C  -1.285848 1.018513 0.309268
C  2.362184 0.152666 0.128456
C  3.131434 -0.49531 -0.874645
C  -1.917963 -0.100815 -0.29429
C  -3.31931 -0.117907 -0.384635
C  5.184005 0.051446 0.314867
C  3.021555 0.728044 1.253155
C  -2.086371 2.0847 0.803522
C  0.183685 1.086737 0.426488
C  4.426958 0.668727 1.337486
C  -4.129714 0.934692 0.103276
C  -3.494521 2.041562 0.701218
C  5.354779 -1.190706 -1.91311
H  2.595507 -0.959333 -1.710063
H  -1.312824 -0.926341 -0.67809
H  6.276774 0.00931 0.396452
H  -1.599363 2.950524 1.268683
H  2.438971 1.171952 2.068724
H  0.586543 2.005482 0.903215
H  4.936773 1.091536 2.210622
H  -5.216316 0.867952 0.007176
H  -4.097147 2.870045 1.086394
H  4.791271 -2.002975 -2.404365
H  5.62052 -0.45466 -2.696651
H  6.298503 -1.613231 -1.525702
