program: Gaussian 09
title: 000292067
version: EM64L-G09RevD.01
frameworkgroup: C1[X(C11H17NS)]
method: RPBEPBE
basis: SDD
operation: Freq
keyword: #p
keyword: freq=noraman
keyword: PBEPBE/SDD
title: #p freq=noraman PBEPBE/SDD
converged: YES YES NO NO
title: Mulliken charges:
elementType: S N C C C C C C C C C C C H H H H H H H H H H H H H H H H H
charge: 0.166568 -0.702827 -0.337277 -0.343865 -0.350814 -0.691288 -0.692843 -0.117197 -0.442481 -0.214100 0.516508 -0.218792 -0.427565 0.187200 0.187278 0.210312 0.210784 0.196302 0.196167 0.259895 0.257427 0.209857 0.209823 0.217430 0.230168 0.241887 0.216334 0.216037 0.303967 0.305107
chargesum: 0.00000
title: Mulliken charges with hydrogens summed into heavy atoms:
elementType: S N C C C C C C C C C C C
charge: 0.166568 -0.093754 0.037201 0.077231 0.041655 -0.173966 -0.055734 -0.117197 -0.212313 0.027787 0.516508 -0.002458 -0.211528
polarizability: 2.28653336e+02 -5.44633584e-01 1.39457037e+02 1.86501699e+00 -4.69425012e-01 8.00174823e+01
1716.lowfreq: -12.1133 -5.0802 -0.0024 -0.0016 -0.0008 3.5011 12.2719 42.4976 49.6307
frequency: 12.1283 42.4614 49.4734 62.2451 121.7318 130.9337 144.1151 171.7097 188.5044 216.0533 233.9385 251.0438 334.0944 362.2128 367.6621 391.7190 414.3821 439.4256 458.5090 527.9686 573.2671 668.7331 680.8266 708.5192 730.3308 757.0173 767.7856 834.4547 843.8840 853.5969 871.4537 896.1833 948.4705 954.4107 974.6666 1006.9983 1022.6183 1058.4593 1061.0889 1071.7916 1074.7806 1112.0275 1112.7355 1181.8217 1196.2693 1227.4960 1253.5636 1277.3578 1289.2705 1292.9995 1293.7696 1319.7170 1336.3004 1353.2482 1388.0800 1391.8854 1439.2084 1453.9721 1466.0391 1469.9467 1478.7316 1479.8420 1484.7386 1487.9046 1577.8846 1618.1920 1640.7105 2957.6503 2969.7560 2973.5139 2981.2007 2997.9345 3003.9405 3022.2150 3042.7448 3070.5479 3072.4319 3082.9327 3118.1639 3119.9203 3141.3870 3169.9591 3569.1139 3709.9842
redmass: 5.5822 1.8120 3.4873 3.4369 1.7473 2.3792 3.7557 4.7818 4.6662 3.4010 1.1217 4.2516 1.2178 3.2830 1.0630 5.5081 3.0376 2.7496 4.4609 6.2249 4.7453 7.2357 1.8412 6.2136 1.0709 1.3102 1.2587 1.2440 1.3384 1.6631 5.1174 1.8173 1.1975 1.3150 6.1028 4.1612 1.5176 2.9120 1.1256 2.3228 2.2137 1.6701 1.8219 1.0800 1.6095 1.2362 1.2811 1.3175 1.0524 1.5397 1.1339 1.8102 1.4076 1.6037 7.6734 1.2175 2.7801 1.1074 1.0667 1.0755 1.0443 1.0697 2.8083 1.0897 6.3128 4.5520 1.2427 1.0587 1.0586 1.0370 1.0592 1.0990 1.0555 1.1026 1.1045 1.1010 1.0993 1.1089 1.0877 1.0896 1.0942 1.0953 1.0448 1.1041
irintensity: 1.4301 0.0517 0.2576 1.6138 0.1037 0.4567 0.6455 2.9557 1.0909 5.3926 0.0065 0.8704 290.5610 0.2039 25.4044 0.1742 2.6458 5.0329 6.6004 0.7671 0.0648 7.8123 29.7309 5.5870 13.5986 33.4135 20.8974 0.2991 0.3687 40.6851 56.3532 2.5621 0.0115 0.3908 10.7216 1.2619 8.0960 4.1375 1.2477 12.5102 12.9243 7.5638 14.1540 8.9184 0.0128 0.4554 0.1239 4.0665 0.4006 16.8127 0.6284 18.6344 10.1450 0.2613 15.0742 11.8880 10.2485 12.3596 2.3239 1.7858 11.7677 2.0812 87.9443 18.5474 70.6151 199.5662 256.1273 5.9616 41.1340 36.8233 40.3962 0.6531 29.8557 7.0089 34.2855 73.9132 53.9806 54.5759 2.9235 20.4181 30.2892 10.4965 65.6625 19.5514
temp: 298.150 k
press: 1.00000 atm
elementType: 16 7 6 6 6 6 6 6 6 6 6 6 6 1 1 1 1 1 1 1 1 1 1 1 1 1 1 1 1 1
symmnumber: 1
zpe: 669351.1 jmol-1
zpe.correction: 0.254942 hartree
zpe.thermalcorrener: 0.270041 hartree
zpe.thermalcorrenthalpy: 0.270985 hartree
zpe.thermalcorrgfe: 0.210556 hartree
zpe.sumelectzpe: -881.182827 hartree
zpe.sumelectthermal: -881.167728 hartree
zpe.sumelectthermalent: -881.166784 hartree
zpe.sumelectthermalfe: -881.227214 hartree
dipole: 0.8681 0.3475 0.1137
dipole: 0.9420
quadrupole: -61.1159 -82.8337 -92.8725
quadrupole: -4.8290 0.7317 -0.3469
quadrupole: 17.8248 -3.8930 -13.9318 -4.8290 0.7317 -0.3469
hfenergy: -881.4377693 hartree
pointgroup: C01 [X(C11H17N1S1)]
dipole: -0.345656 -0.1319617 0.0212043 debye
polarizability: 228.500619|-2.9289499|137.16217|-3.1456199|11.7892535|82.4650664 unknown
InChI: InChI=1S/C11H17NS/c1-2-3-4-8-13-11-7-5-6-10(12)9-11/h5-7,9H,2-4,8,12H2,1H3
charge 0 multiplicity 1
30 atoms
S  0.150275 1.345188 0.036281
N  -5.047337 1.163605 0.172714
C  4.024106 -0.320419 -0.235052
C  2.87188 0.698338 -0.061065
C  5.421155 0.327279 -0.094857
C  1.492394 0.033361 -0.205167
C  6.571459 -0.689303 -0.260177
C  -1.404247 0.374266 -0.114889
C  -2.602964 1.098618 0.078841
C  -1.438876 -1.010885 -0.407726
C  -3.863176 0.44712 -0.018831
C  -2.696466 -1.65251 -0.501758
C  -3.90031 -0.94858 -0.313175
H  3.944348 -0.804652 -1.230651
H  3.919958 -1.129843 0.5172
H  2.976681 1.505064 -0.813525
H  2.950886 1.177284 0.93508
H  5.52595 1.133868 -0.8486
H  5.497591 0.816314 0.897522
H  1.349544 -0.750723 0.559185
H  1.370188 -0.408311 -1.20985
H  6.506781 -1.488143 0.50254
H  6.53481 -1.171814 -1.255177
H  7.55877 -0.202874 -0.156934
H  -2.56446 2.170868 0.308533
H  -0.523753 -1.587544 -0.562518
H  -2.732172 -2.724603 -0.728451
H  -4.864018 -1.466005 -0.390926
H  -5.949222 0.702381 0.104757
H  -5.02848 2.156854 0.382778
