program: Gaussian 09
title: 000292075
version: EM64L-G09RevD.01
frameworkgroup: C1[X(C14H12N4O)]
method: RPBEPBE
basis: SDD
operation: Freq
keyword: #p
keyword: freq=noraman
keyword: PBEPBE/SDD
title: #p freq=noraman PBEPBE/SDD
converged: YES YES NO NO
title: Mulliken charges:
elementType: O N N N N C C C C C C C C C C C C C C H H H H H H H H H H H H
charge: -0.252244 -0.275089 0.000628 -0.029334 -0.023050 0.405691 0.358395 -0.474553 0.027248 0.155651 -0.748661 -0.785804 -0.302881 0.100368 -0.227777 -0.276506 -0.182265 -0.162527 -0.356635 0.241570 0.253851 0.224274 0.253975 0.242157 0.266739 0.242129 0.335900 0.264458 0.241292 0.235342 0.247658
chargesum: 0.00000
title: Mulliken charges with hydrogens summed into heavy atoms:
elementType: O N N N N C C C C C C C C C C C C C C
charge: -0.252244 -0.275089 0.000628 -0.029334 -0.023050 0.405691 0.358395 -0.232983 0.027248 0.155651 -0.016561 -0.034779 0.033019 0.100368 -0.227777 -0.012048 0.059027 0.072815 -0.108977
polarizability: 3.53319563e+02 -3.62184108e+00 2.06473748e+02 -7.37086239e-02 -3.29678701e-01 7.83683613e+01
1716.lowfreq: -35.0606 -8.7699 -3.7211 -3.2833 0.0004 0.0007 0.0007 21.3515 33.9774
frequency: -35.0538 21.2808 33.9658 63.4140 78.7803 88.9001 129.7278 163.8292 186.4520 203.3104 222.0006 235.0473 243.0065 250.6379 290.3590 357.0293 368.5434 406.8639 407.2655 429.7400 462.1115 485.6554 494.5009 513.2633 578.1201 599.1640 609.8383 618.6231 639.3931 645.2907 701.7579 745.2160 759.0252 790.8300 846.2972 850.0556 880.7744 907.1986 955.1805 959.3677 965.9685 1000.5075 1007.5788 1016.7809 1032.5672 1036.6494 1040.6938 1048.2087 1058.2148 1085.0121 1125.4346 1159.3070 1209.0315 1227.9717 1233.9633 1276.7306 1318.6274 1328.4670 1366.7378 1397.9136 1401.3402 1406.1808 1413.1055 1449.0117 1451.2536 1459.3765 1469.9345 1471.3266 1538.3573 1549.4687 1557.3323 1574.0836 1577.8505 1633.9178 2175.6889 2985.6699 3000.9206 3062.2361 3084.9933 3110.3276 3111.5011 3133.4172 3143.7779 3157.7023 3165.7151 3170.3106 3177.2487
redmass: 1.0301 4.6554 5.5611 5.6844 5.2393 5.2054 8.5145 4.2513 2.1539 6.4770 1.4488 3.2664 4.1603 5.0304 2.8687 6.3023 5.1684 3.7004 6.0528 5.8733 8.8965 5.3836 6.8024 3.2847 6.0388 4.2381 7.4907 4.4639 4.5707 5.1450 7.0799 1.9516 7.2217 1.9831 1.2476 4.7149 6.7641 1.3085 2.3908 4.8394 1.4394 1.4765 1.3614 2.9462 2.3279 1.8733 1.5743 1.5353 3.1549 1.6927 5.0438 1.0810 2.7721 2.5336 1.8840 1.6709 3.5377 3.1058 4.1519 1.6655 1.7199 1.2591 1.9417 1.0471 2.4471 1.1616 1.0458 1.2343 7.6133 5.4165 5.7840 7.6617 6.1796 7.1165 12.6313 1.0385 1.0364 1.0968 1.0966 1.1010 1.0986 1.0877 1.0904 1.0924 1.0953 1.0924 1.1001
irintensity: 0.7384 0.0195 1.5054 0.2410 0.3076 0.0547 5.7877 0.9866 0.2097 1.9803 5.1107 8.2900 7.9511 3.4232 2.4218 4.2283 5.4868 4.6073 1.5635 6.7273 2.4350 0.0004 11.2808 8.8644 7.4824 7.8732 5.0747 0.6487 7.6873 9.1197 0.2274 27.3643 9.4956 28.8359 20.4541 3.3848 6.4945 0.0031 1.1049 2.5885 0.0701 24.7303 2.5469 4.0690 15.9670 19.0509 9.0303 11.7790 31.6269 16.1284 20.9403 0.2733 52.8406 4.6981 12.5508 2.4671 6.7748 14.3884 69.2316 132.5706 0.6629 18.2450 9.3897 15.1790 19.1293 27.0976 16.0256 19.9210 29.0202 32.3557 38.3651 203.9803 28.7069 246.1985 36.5981 9.5281 11.6592 10.4998 7.2329 26.1201 7.8128 13.5781 11.1564 3.2605 25.4712 5.0181 17.0211
temp: 298.150 k
press: 1.00000 atm
elementType: 8 7 7 7 7 6 6 6 6 6 6 6 6 6 6 6 6 6 6 1 1 1 1 1 1 1 1 1 1 1 1
symmnumber: 1
zpe: 607644.5 jmol-1
zpe.correction: 0.231440 hartree
zpe.thermalcorrener: 0.247939 hartree
zpe.thermalcorrenthalpy: 0.248883 hartree
zpe.thermalcorrgfe: 0.185945 hartree
zpe.sumelectzpe: -833.551044 hartree
zpe.sumelectthermal: -833.534545 hartree
zpe.sumelectthermalent: -833.533601 hartree
zpe.sumelectthermalfe: -833.596538 hartree
dipole: -3.2373 8.9925 0.0136
dipole: 9.5575
quadrupole: -89.0495 -118.5252 -112.2206
quadrupole: 18.4163 0.2015 -0.1098
quadrupole: 17.5489 -11.9267 -5.6222 18.4163 0.2015 -0.1098
hfenergy: -833.7824838 hartree
pointgroup: C01 [X(C14H12N4O1)]
dipole: 1.2339954 1.7130219 -3.1115919 debye
polarizability: 351.5397991|-15.9443993|112.5507298|-15.3026566|-55.266334|174.0711425 unknown
InChI: InChI=1S/C14H12N4O/c1-10-7-11(2)18(14(19)13(10)8-15)17-9-12-5-3-4-6-16-12/h3-7,9H,1-2H3
charge 0 multiplicity 1
31 atoms
O  -0.882338 -0.672026 2.260837
N  -0.716774 0.509906 0.206691
N  0.687561 0.462293 0.074754
N  3.66881 -0.770371 1.660184
N  -4.342913 -0.91358 3.205906
C  -1.342097 1.186325 -0.855307
C  -3.550789 0.782806 0.17567
C  -2.725035 1.315279 -0.863968
C  -2.927076 0.108186 1.237474
C  -1.472585 -0.068957 1.317682
C  -0.48132 1.749943 -1.956041
C  -5.050073 0.961785 0.097269
C  1.469684 -0.135053 0.952592
C  2.926657 -0.116226 0.704082
C  -3.68812 -0.453171 2.316599
C  3.519713 0.520121 -0.421586
C  4.920112 0.47886 -0.56589
C  5.69178 -0.193139 0.412954
C  5.021524 -0.798684 1.50218
H  -3.187977 1.844445 -1.700278
H  0.24943 2.47627 -1.56069
H  -1.12025 2.248373 -2.702745
H  0.104048 0.956361 -2.451903
H  -5.309435 2.036556 0.064016
H  -5.569055 0.507212 0.955135
H  -5.445375 0.505596 -0.829593
H  1.136229 -0.650016 1.858356
H  2.877322 1.025992 -1.147489
H  5.405242 0.959296 -1.422135
H  6.782293 -0.248241 0.337907
H  5.580706 -1.328043 2.281941
