program: Gaussian 09
title: 000292087
version: EM64L-G09RevD.01
frameworkgroup: C1[X(C16H12Cl2O)]
method: RPBEPBE
basis: SDD
operation: Freq
keyword: #p
keyword: freq=noraman
keyword: PBEPBE/SDD
title: #p freq=noraman PBEPBE/SDD
converged: YES YES NO NO
title: Mulliken charges:
elementType: Cl Cl O C C C C C C C C C C C C C C C C H H H H H H H H H H H H
charge: -0.025928 -0.031079 -0.242358 0.297568 0.438108 -0.332033 -0.349757 -0.408855 -0.381150 0.601311 0.089008 -0.256162 -0.291795 -0.805850 -0.311121 -0.363209 -0.224870 -0.236103 -0.103534 0.213530 0.279773 0.232734 0.235295 0.292199 0.203221 0.230347 0.227853 0.240964 0.235251 0.285165 0.261478
chargesum: 0.00000
title: Mulliken charges with hydrogens summed into heavy atoms:
elementType: Cl Cl O C C C C C C C C C C C C C C C C
charge: -0.025928 -0.031079 -0.242358 0.297568 0.438108 -0.118503 -0.069984 -0.176121 -0.145855 0.601311 0.089008 0.036037 -0.088574 -0.106687 -0.311121 -0.127958 0.060295 0.025375 -0.103534
polarizability: 4.15670575e+02 -6.67552322e+00 2.12802923e+02 -1.84834951e+00 1.20788311e+00 7.75442596e+01
1716.lowfreq: -18.5223 -1.5308 0.0008 0.0023 0.0027 3.3323 5.0322 7.7351 21.4881
frequency: -18.2732 7.4429 21.4111 41.6237 56.7409 79.3740 124.1628 134.9074 159.7188 160.2711 172.2126 209.3987 252.5460 277.6828 343.8353 345.9090 348.9717 370.1643 402.5469 403.4080 444.0646 451.3059 479.2262 540.9507 549.9854 588.3521 634.7000 642.6266 665.3362 695.6450 715.4148 743.8845 778.4204 813.5308 818.6580 832.2824 858.7533 869.4598 878.9497 890.4762 955.8021 959.7784 985.6636 1004.1240 1007.5703 1020.0878 1022.7295 1032.8678 1046.6640 1086.8628 1124.4862 1136.7772 1192.3571 1215.8522 1221.3275 1233.0053 1270.0734 1298.7370 1303.1038 1337.0169 1361.7892 1374.0714 1389.2530 1397.8452 1412.1904 1456.8622 1467.5978 1472.0185 1503.3757 1517.1396 1553.4978 1576.9467 1588.2892 1618.6484 1635.9208 2976.2755 3058.2285 3088.8665 3123.2459 3124.3456 3127.6375 3144.9094 3153.2100 3157.5923 3161.3793 3178.6732 3186.7102
redmass: 1.0553 5.1615 4.2045 7.1347 8.4660 3.5298 4.7317 4.6431 6.4989 8.3495 4.8075 11.0809 6.2403 3.9400 4.1141 3.4895 6.5139 10.1168 2.7996 8.9593 3.0077 6.0366 2.8748 4.8137 4.4495 6.0888 6.9498 7.2056 3.5244 7.5486 3.3786 2.5658 5.8734 5.9858 1.4033 1.6069 1.3401 1.4155 4.4277 2.0440 1.3665 1.3784 1.4796 1.3649 3.3643 1.2737 2.9594 3.1367 1.5926 2.4900 1.3283 1.5128 1.1751 1.9835 2.7061 1.8365 1.4233 1.3937 2.2283 1.5261 3.4671 4.3541 5.2658 1.2244 3.6198 2.7014 1.1190 1.0591 2.6542 8.2536 7.6412 6.2393 7.0037 6.2095 5.7337 1.0392 1.0942 1.1000 1.0898 1.0882 1.0892 1.0922 1.0890 1.0913 1.0942 1.0967 1.0939
irintensity: 0.6225 0.1072 0.2191 0.1379 2.3421 0.3186 0.2803 0.2977 0.1579 0.5903 0.2402 0.1609 4.2186 3.1901 0.2572 2.0097 0.4611 17.5002 0.1062 24.9268 6.6718 4.5064 17.2254 2.0615 10.6251 14.9565 1.7806 1.1444 2.8518 28.0328 0.6980 10.8683 46.6038 27.7963 70.7403 5.9076 19.4819 19.2973 0.8750 3.0650 0.5510 0.2260 5.9188 1.4186 34.1448 39.1192 19.1496 109.1821 25.5912 60.4176 13.6749 38.3572 126.2698 58.6687 37.9706 48.4743 24.6050 58.8319 180.0271 18.7312 72.7321 36.1305 17.5848 14.4872 10.2724 151.0725 10.2389 13.3831 1.8348 153.3462 20.5543 35.9835 86.4044 183.3445 177.0932 28.6801 22.0078 15.5580 9.6584 8.8466 23.1888 1.3778 7.1795 29.9351 5.9606 2.5767 0.8512
temp: 298.150 k
press: 1.00000 atm
elementType: 17 17 8 6 6 6 6 6 6 6 6 6 6 6 6 6 6 6 6 1 1 1 1 1 1 1 1 1 1 1 1
symmnumber: 1
zpe: 598526.1 jmol-1
zpe.correction: 0.227967 hartree
zpe.thermalcorrener: 0.244992 hartree
zpe.thermalcorrenthalpy: 0.245936 hartree
zpe.thermalcorrgfe: 0.178999 hartree
zpe.sumelectzpe: -1610.917101 hartree
zpe.sumelectthermal: -1610.900075 hartree
zpe.sumelectthermalent: -1610.899131 hartree
zpe.sumelectthermalfe: -1610.966068 hartree
dipole: -2.2188 -4.4291 0.0136
dipole: 4.9538
quadrupole: -104.9531 -123.4899 -129.6227
quadrupole: 9.0921 -0.3086 -0.0015
quadrupole: 14.4021 -4.1347 -10.2675 9.0921 -0.3086 -0.0015
hfenergy: -1611.1450674 hartree
pointgroup: C01 [X(C16H12Cl2O1)]
dipole: 0.7891396 1.6882353 -0.5706115 debye
polarizability: 415.821671|3.9481427|197.685835|2.2960268|-42.3785418|92.5102509 unknown
InChI: InChI=1S/C16H12Cl2O/c1-11-2-4-13(5-3-11)16(19)9-7-12-6-8-14(17)10-15(12)18/h2-10H,1H3
charge 0 multiplicity 1
31 atoms
Cl -3.509522 -2.928712 0.830467
Cl -6.777664 1.304939 -0.519782
O  1.355592 -2.192478 0.817949
C  2.642211 -0.290907 0.085706
C  5.195358 0.930751 -0.389012
C  2.734083 1.008302 -0.484462
C  3.849914 -0.96897 0.410067
C  3.990523 1.603951 -0.718431
C  5.099713 -0.370319 0.17689
C  -2.477387 -0.395156 0.104512
C  1.346961 -1.00176 0.358215
C  -1.132574 -0.943487 0.307581
C  0.05801 -0.302355 0.090955
C  6.544218 1.587166 -0.612704
C  -3.64617 -1.186826 0.309864
C  -2.702353 0.956285 -0.303018
C  -4.951494 -0.692746 0.126381
C  -3.989565 1.484819 -0.495881
C  -5.102958 0.646181 -0.27725
H  1.834394 1.566014 -0.76296
H  3.770355 -1.972257 0.84161
H  4.03956 2.604324 -1.164943
H  6.017643 -0.913013 0.432904
H  -1.062559 -1.977407 0.670391
H  0.089109 0.727927 -0.276612
H  7.321286 0.842653 -0.859656
H  6.505672 2.329214 -1.428996
H  6.879263 2.118443 0.299698
H  -1.839913 1.609306 -0.467418
H  -5.819653 -1.334055 0.2931
H  -4.130154 2.523476 -0.806466
