program: Gaussian 09
title: 000292076
version: EM64L-G09RevD.01
frameworkgroup: C1[X(C14H17N3O)]
method: RPBEPBE
basis: SDD
operation: Freq
keyword: #p
keyword: freq=noraman
keyword: PBEPBE/SDD
title: #p freq=noraman PBEPBE/SDD
converged: YES YES NO NO
title: Mulliken charges:
elementType: O N N N C C C C C C C C C C C C C C H H H H H H H H H H H H H H H H H
charge: -0.243454 -0.053390 -0.265960 -0.036792 -0.393451 -0.387089 -0.390449 -0.521627 -0.515699 0.252597 0.377347 0.071171 -0.518777 0.383877 0.067281 -0.768094 -0.792255 -0.227474 0.183883 0.219963 0.209095 0.229722 0.269376 0.204728 0.207266 0.244055 0.256561 0.213229 0.245264 0.269132 0.232693 0.243382 0.254308 0.252243 0.227337
chargesum: 0.00000
title: Mulliken charges with hydrogens summed into heavy atoms:
elementType: O N N N C C C C C C C C C C C C C C
charge: -0.243454 -0.053390 -0.265960 -0.036792 0.010396 0.051728 0.083656 -0.070307 -0.045909 0.252597 0.377347 0.071171 -0.273514 0.383877 0.067281 -0.022887 -0.058367 -0.227474
polarizability: 2.44160249e+02 -8.98185162e+00 1.99154137e+02 4.84164342e+00 4.25022469e+00 1.10271847e+02
1716.lowfreq: -8.5907 -0.0001 0.0006 0.0008 3.3262 13.5425 32.5716 48.7916 54.3863
frequency: 31.8884 48.7867 53.6946 59.0910 86.2341 117.5176 136.9587 154.4464 161.2025 179.1856 216.9639 241.6899 257.5807 281.6286 307.1633 342.5642 355.3804 391.6933 405.0417 421.2914 447.7032 451.9708 475.1735 483.8134 567.4283 583.8029 591.4425 609.5416 639.6161 659.0441 680.6255 749.2737 773.1433 782.9824 832.4643 836.9974 856.2581 865.1418 907.1042 918.5460 949.8993 980.7712 1012.4658 1030.5756 1039.0758 1042.6541 1042.7486 1047.4563 1081.1718 1096.3754 1107.1435 1119.6929 1130.6556 1217.5747 1223.9892 1231.9994 1243.3210 1251.5297 1277.9618 1302.0505 1312.6152 1339.7710 1345.4659 1346.3203 1367.5942 1400.9354 1402.2500 1410.0222 1447.3890 1447.7812 1458.4645 1461.4287 1465.1233 1465.9732 1468.0139 1473.8227 1479.7204 1534.7381 1569.1211 1591.1386 1622.5053 2168.7226 2961.3727 2964.7884 2974.7544 2987.1310 2990.7202 2993.0968 3006.0294 3036.9008 3055.4113 3065.9168 3068.6509 3076.3535 3077.6042 3084.4915 3101.2494 3113.7532 3175.7260
redmass: 1.0256 4.4927 4.1707 4.4538 4.3350 4.3930 5.1511 1.4860 2.0765 3.2348 2.8294 5.0280 2.8617 2.7445 2.5937 3.3308 3.4494 4.0965 6.5959 2.9927 4.3991 6.8789 1.9446 4.8824 4.9637 6.1872 4.7301 3.5885 4.6715 3.2348 6.2146 7.9448 2.2450 1.9973 1.3462 2.8742 1.4675 3.7718 2.5312 1.4647 2.1206 2.6270 2.4240 2.1933 1.5905 2.2552 2.1784 1.6774 1.1970 1.5365 2.1050 3.1205 2.0303 1.4509 1.6852 4.5408 1.4290 1.3616 1.4658 1.4175 1.3962 1.4822 1.5241 1.5305 4.5336 1.1960 1.2715 2.8492 1.0593 1.1042 1.1048 1.0477 1.1739 1.1040 1.0915 1.2587 1.0883 5.2817 6.5853 7.8517 8.6388 12.6201 1.0669 1.0644 1.0653 1.0375 1.0375 1.0611 1.0631 1.0955 1.1030 1.0967 1.0961 1.0991 1.0968 1.0959 1.0998 1.0999 1.0925
irintensity: 0.7343 0.5632 4.3891 3.4927 0.5002 1.6150 1.9738 2.4673 0.2167 0.7304 1.0603 2.1386 1.4678 0.9620 0.5102 1.9867 1.3888 1.6229 1.2116 0.0458 0.1072 1.4620 0.1676 1.3926 0.8670 5.6917 5.1303 4.1956 0.0860 3.3816 0.1097 2.2485 4.0418 2.4739 18.5790 4.1047 13.5013 2.7532 5.9570 5.7186 2.3565 17.7848 9.3473 7.2511 16.8796 1.7327 5.5031 1.7637 3.7142 1.3110 0.1358 8.7172 7.7625 0.8737 10.2881 11.2450 7.8481 9.7186 2.2742 6.5675 4.6901 0.1109 2.1260 5.7373 23.5570 35.0666 17.1845 86.7173 13.9368 16.2632 7.1965 18.0117 21.8965 19.3614 10.3187 16.2498 13.8839 26.6837 217.3018 47.9593 312.4897 48.0462 9.1820 46.7244 30.7050 10.8662 10.9382 32.9652 35.9284 54.0266 44.7806 7.5443 9.2620 15.2451 22.6503 20.7329 19.8876 19.3658 5.1627
temp: 298.150 k
press: 1.00000 atm
elementType: 8 7 7 7 6 6 6 6 6 6 6 6 6 6 6 6 6 6 1 1 1 1 1 1 1 1 1 1 1 1 1 1 1 1 1
symmnumber: 1
zpe: 745895.9 jmol-1
zpe.correction: 0.284097 hartree
zpe.thermalcorrener: 0.301592 hartree
zpe.thermalcorrenthalpy: 0.302536 hartree
zpe.thermalcorrgfe: 0.238246 hartree
zpe.sumelectzpe: -781.820762 hartree
zpe.sumelectthermal: -781.803267 hartree
zpe.sumelectthermalent: -781.802323 hartree
zpe.sumelectthermalfe: -781.866613 hartree
dipole: -2.2683 6.8853 2.8452
dipole: 7.7877
quadrupole: -91.6443 -117.7149 -107.4636
quadrupole: 15.0064 1.1003 -1.7765
quadrupole: 13.9633 -12.1073 -1.8560 15.0064 1.1003 -1.7765
hfenergy: -782.1048588 hartree
pointgroup: C01 [X(C14H17N3O1)]
dipole: 1.2570942 -2.6924661 0.7469103 debye
polarizability: 245.485451|-2.0713049|197.344614|-7.299262|6.7366789|110.7561675 unknown
InChI: InChI=1S/C14H17N3O/c1-10-8-11(2)17(14(18)13(10)9-15)16-12-6-4-3-5-7-12/h8H,3-7H2,1-2H3
charge 0 multiplicity 1
35 atoms
O  0.023552 1.424741 -0.292766
N  1.231285 -1.063664 -0.628637
N  -0.122853 -0.932353 -0.136565
N  -3.349562 2.751878 0.280713
C  4.124631 1.582511 0.807464
C  4.140734 0.920021 -0.589865
C  2.701773 1.582442 1.412648
C  3.5706 -0.528527 -0.529927
C  2.099086 0.146355 1.453975
C  2.18739 -0.506103 0.08961
C  -0.85891 -2.099432 -0.010312
C  -0.707014 0.407343 -0.106593
C  -2.232106 -2.017957 0.244171
C  -2.898765 -0.763777 0.331027
C  -2.145257 0.41737 0.150147
C  -0.126824 -3.408457 -0.148373
C  -4.387175 -0.698403 0.598636
C  -2.78084 1.700144 0.216081
H  4.82002 1.037794 1.480418
H  4.498079 2.621635 0.735254
H  5.169377 0.885632 -0.995335
H  3.528417 1.518089 -1.291731
H  2.027836 2.213624 0.807259
H  2.71747 1.995065 2.438752
H  4.240785 -1.145486 0.103836
H  3.522356 -0.985973 -1.532147
H  1.065519 0.169678 1.833812
H  2.705087 -0.472545 2.150367
H  -2.792847 -2.946654 0.370162
H  0.402448 -3.453075 -1.11706
H  -0.834632 -4.248952 -0.076385
H  0.643785 -3.527002 0.635581
H  -4.91832 -0.214866 -0.242147
H  -4.60299 -0.088969 1.495353
H  -4.814238 -1.703528 0.747578
