program: Gaussian 09
title: 000292066
version: EM64L-G09RevD.01
frameworkgroup: C1[X(C13H9NO5)]
method: RPBEPBE
basis: SDD
operation: Freq
keyword: #p
keyword: freq=noraman
keyword: PBEPBE/SDD
title: #p freq=noraman PBEPBE/SDD
converged: NO YES NO NO
title: Mulliken charges:
elementType: O O O O O N C C C C C C C C C C C C C H H H H H H H H H
charge: -0.285505 -0.441546 -0.246458 -0.211478 -0.211445 0.022646 0.347424 0.344006 0.255066 -0.370281 -0.348335 -0.318946 -0.350541 0.381787 -0.324406 -0.306994 -0.343831 -0.329899 0.115952 0.267801 0.274056 0.279265 0.271281 0.279000 0.280792 0.289921 0.292052 0.388615
chargesum: 0.00000
title: Mulliken charges with hydrogens summed into heavy atoms:
elementType: O O O O O N C C C C C C C C C C C C C
charge: -0.285505 -0.052931 -0.246458 -0.211478 -0.211445 0.022646 0.347424 0.344006 0.255066 -0.102480 -0.074279 -0.039681 -0.079260 0.381787 -0.045406 -0.026201 -0.053910 -0.037847 0.115952
polarizability: 3.24153710e+02 -1.92404384e+00 1.50562577e+02 1.69224607e+01 6.60390333e-01 9.22641843e+01
1716.lowfreq: -8.4659 -2.8874 -0.0007 -0.0004 -0.0002 3.8494 22.1141 33.3507 43.8210
frequency: 22.0999 33.3191 43.8162 71.8495 81.2563 107.1027 117.2299 178.2201 191.0939 247.0079 283.1899 293.2590 345.4588 373.5465 413.0985 418.7915 441.7426 479.8004 487.3541 494.9947 508.1423 582.6300 592.2934 609.3483 622.7454 641.7200 663.7772 681.7690 697.4566 730.4090 751.0292 761.3338 796.4054 830.4040 845.2468 853.8281 861.3735 870.4479 979.2842 984.5689 989.8973 993.7417 997.0574 999.5911 1019.8129 1094.4392 1107.3764 1113.8074 1147.5551 1157.2707 1167.5435 1190.4470 1219.5223 1231.5324 1286.6515 1296.0098 1323.1235 1358.1769 1380.4884 1405.8680 1417.6361 1428.7165 1471.2548 1489.2693 1582.0035 1593.6567 1601.5313 1619.6512 1645.1089 3158.5692 3159.8608 3167.2629 3172.0913 3179.3186 3184.3241 3187.3648 3191.8008 3533.3746
redmass: 7.2010 7.8348 7.9000 6.8056 5.8558 8.3264 6.4780 8.2106 9.5080 7.0830 6.2990 5.9385 8.5904 7.8814 2.9366 3.0297 5.8267 5.3084 3.1726 4.1098 7.0894 2.7836 1.7124 4.8516 6.8533 7.1381 4.8243 4.0026 4.9699 4.9140 5.5465 5.8125 7.4557 1.2857 1.3235 1.9843 2.9024 1.7027 1.3442 1.3329 1.3499 1.3577 3.0154 4.0903 2.7620 3.2326 1.2525 1.2954 1.7831 1.8897 1.4898 1.5456 4.9319 5.1080 1.2773 1.3142 2.6754 7.7153 6.6767 10.2401 4.0406 4.1464 2.4447 2.6464 7.8677 7.4649 6.8632 6.6092 8.7270 1.0897 1.0892 1.0892 1.0895 1.0967 1.0968 1.0961 1.0974 1.0642
irintensity: 2.2310 0.6931 0.8005 0.3413 0.3923 3.5385 0.8211 1.0404 3.3998 0.4686 1.8767 2.5956 13.5489 5.7998 1.6661 1.3197 6.4716 30.5730 37.3847 15.3910 0.9158 47.3917 64.1212 15.1570 2.3891 4.4900 28.4278 52.4671 16.9737 17.2021 18.8763 12.1756 6.4064 5.8356 12.9139 63.5253 84.5902 36.8025 3.4719 0.6995 1.5887 0.2278 39.9063 147.1268 172.6578 18.6372 22.2648 9.9663 163.1305 57.7867 264.4475 10.4450 900.7425 163.3353 1.5471 14.6912 144.4189 90.5637 5.9879 19.8559 20.4148 23.4135 162.0703 103.2067 20.4187 98.2447 333.1897 17.5655 326.3494 6.2328 0.2531 1.3360 0.5489 1.8935 2.0335 1.2269 4.3218 58.0659
temp: 298.150 k
press: 1.00000 atm
elementType: 8 8 8 8 8 7 6 6 6 6 6 6 6 6 6 6 6 6 6 1 1 1 1 1 1 1 1 1
symmnumber: 1
zpe: 515896.5 jmol-1
zpe.correction: 0.196495 hartree
zpe.thermalcorrener: 0.212303 hartree
zpe.thermalcorrenthalpy: 0.213247 hartree
zpe.thermalcorrgfe: 0.150775 hartree
zpe.sumelectzpe: -930.246302 hartree
zpe.sumelectthermal: -930.230493 hartree
zpe.sumelectthermalent: -930.229549 hartree
zpe.sumelectthermalfe: -930.292021 hartree
dipole: -3.7200 0.7112 0.9306
dipole: 3.9001
quadrupole: -151.6153 -103.2274 -107.5477
quadrupole: 18.5714 -2.7861 -1.9522
quadrupole: -30.8185 17.5694 13.2491 18.5714 -2.7861 -1.9522
hfenergy: -930.4427962 hartree
pointgroup: C01 [X(C13H9N1O5)]
dipole: -1.4655991 -0.2426193 -0.3841137 debye
polarizability: 324.399001|-0.6868741|150.4398833|-15.2645373|2.6939253|92.1415872 unknown
InChI: InChI=1S/C13H9NO5/c15-13(16)9-1-5-11(6-2-9)19-12-7-3-10(4-8-12)14(17)18/h1-8,15H
charge 0 multiplicity 1
28 atoms
O  0.022147 -1.622562 -0.149629
O  -5.254466 2.002243 -0.677816
O  -6.137289 0.267577 0.590705
O  5.297707 1.875346 0.772035
O  6.146174 0.083473 -0.359806
N  5.16601 0.738258 0.170892
C  -1.215579 -0.9337 -0.091329
C  1.256431 -0.951472 -0.080283
C  -3.779755 0.21398 -0.04305
C  -2.257732 -1.599112 0.592015
C  -1.437576 0.290379 -0.766366
C  1.437126 0.285086 0.590276
C  2.351802 -1.640975 -0.655122
C  3.812597 0.150877 0.085731
C  -3.539213 -1.021254 0.614607
C  -2.723976 0.861127 -0.736194
C  2.72688 0.839021 0.672459
C  3.640053 -1.088307 -0.573735
C  -5.150121 0.783373 0.012652
H  -2.047463 -2.550443 1.088242
H  -0.628272 0.775475 -1.320102
H  0.589178 0.795039 1.055389
H  2.171295 -2.596999 -1.153669
H  -4.367529 -1.50863 1.138368
H  -2.923241 1.802817 -1.254261
H  2.907887 1.786063 1.18716
H  4.507918 -1.589969 -1.008735
H  -6.191294 2.329184 -0.610435
