program: Gaussian 09
title: 000292071
version: EM64L-G09RevD.01
frameworkgroup: C1[X(C16H14N4O)]
method: RPBEPBE
basis: SDD
operation: Freq
keyword: #p
keyword: freq=noraman
keyword: PBEPBE/SDD
title: #p freq=noraman PBEPBE/SDD
converged: YES YES NO NO
title: Mulliken charges:
elementType: O N N N N C C C C C C C C C C C C C C C C H H H H H H H H H H H H H H
charge: -0.227597 -0.194135 -0.357293 -0.075824 -0.079566 0.316334 0.392649 -0.212599 0.170997 -0.757900 -0.337050 -0.394182 -0.215171 -0.195733 -0.245335 0.165317 -0.296142 -0.340557 -0.203779 -0.204629 -0.241683 0.328776 0.249350 0.235917 0.285598 0.247780 0.274915 0.235428 0.237437 0.238625 0.259570 0.261991 0.222951 0.228599 0.226941
chargesum: 0.00000
title: Mulliken charges with hydrogens summed into heavy atoms:
elementType: O N N N N C C C C C C C C C C C C C C C C
charge: -0.227597 -0.194135 -0.028517 -0.075824 -0.079566 0.316334 0.392649 -0.212599 0.170997 0.012965 -0.089270 -0.119267 0.020257 0.041704 -0.006709 0.165317 -0.036572 -0.078567 0.019172 0.023970 -0.014742
polarizability: 5.24003487e+02 -7.05339474e+00 2.00620142e+02 2.68487869e+00 8.84626958e+00 9.55314355e+01
1716.lowfreq: -5.6527 -0.0008 -0.0008 -0.0003 2.7368 5.2264 22.4797 29.0697 43.7070
frequency: 22.3787 29.0394 43.6752 58.8600 72.8341 106.1470 120.4311 172.0961 175.9496 190.0182 218.3102 244.4333 259.4156 270.5049 296.3365 354.2040 376.2289 405.5824 408.0162 410.7329 448.5018 458.1712 504.8487 526.3534 554.3083 582.5644 607.3411 609.0331 613.4064 640.4811 666.1619 693.0302 698.1524 736.4217 759.7575 764.2476 782.1335 825.5812 841.3516 851.9224 861.3230 914.5951 938.0995 974.0608 980.4786 984.9817 985.6634 988.7731 995.4696 997.0835 1013.7478 1027.8100 1043.2417 1056.7836 1072.5875 1078.1998 1084.1800 1135.0948 1152.0957 1168.3409 1175.8945 1188.2913 1194.3801 1250.4398 1296.1255 1309.5765 1321.2275 1353.6614 1375.1262 1382.6810 1391.0212 1402.1417 1433.7969 1441.0751 1442.4690 1460.9993 1463.6936 1478.1263 1496.2515 1545.3552 1581.1602 1590.6228 1601.4524 1608.1854 1648.9498 2987.7051 3068.5237 3112.0130 3123.4988 3136.1946 3137.1044 3145.0847 3151.8712 3159.0882 3163.5576 3169.5166 3170.2276 3179.8167 3539.2285
redmass: 4.1601 4.7728 5.4960 4.1427 5.8979 4.9346 5.6956 1.5073 6.9532 2.0685 5.1353 5.5566 5.7432 3.7301 5.9884 4.9103 3.6931 4.0050 2.9139 4.4512 3.2092 2.0945 2.9867 3.2744 5.8317 5.7538 6.0850 6.5210 6.2123 5.0754 5.7537 1.8819 2.0514 6.5462 6.0174 1.6839 1.8720 4.5320 1.2644 1.2465 6.7061 1.3922 1.4465 1.4012 3.1023 5.7522 1.3930 4.1834 1.3215 1.3176 2.0736 1.9376 1.4867 3.5499 1.7112 2.9347 1.7109 3.5186 1.5999 1.0606 1.0509 1.1261 2.3477 4.8509 1.7908 1.5688 1.3729 4.1661 4.3375 7.6589 4.0088 1.6294 2.3519 1.7019 1.5990 1.7982 2.2927 1.5222 2.2228 5.3664 6.1946 6.5238 6.2975 6.0699 9.6399 1.0383 1.0964 1.0986 1.0851 1.0888 1.0854 1.0891 1.0930 1.0936 1.0948 1.0968 1.1001 1.0993 1.0810
irintensity: 0.2038 0.1281 1.1037 3.7405 2.2303 0.7586 1.2026 1.3192 1.3841 0.9347 2.3347 5.7209 0.2197 0.5449 18.0266 4.6775 34.3242 20.8213 0.4664 9.6713 24.9157 106.5887 15.2931 3.6915 14.2533 7.1466 6.0184 3.8374 3.1378 4.6335 11.5690 42.7011 34.8138 29.8021 10.7679 76.9700 48.1510 0.1976 0.5194 0.1210 6.9733 5.8230 6.9654 0.4698 7.5529 0.5307 0.0330 4.6848 0.8449 0.7026 9.8218 17.6852 2.2671 2.2894 8.3529 4.1905 5.8932 1.3690 6.6781 0.2427 0.1767 1.7599 1.0615 16.9732 125.7025 85.8389 6.2240 34.6061 83.0299 12.8780 1.8523 67.4257 194.2465 38.4321 32.4963 100.8878 1.1547 113.2909 392.5813 310.9078 3.7701 6.4605 2.5629 120.8622 348.9846 19.3948 10.1739 2.7038 3.8694 13.7943 4.7222 7.2692 28.8638 16.0496 18.3131 24.5366 35.0645 7.9157 38.2109
temp: 298.150 k
press: 1.00000 atm
elementType: 8 7 7 7 7 6 6 6 6 6 6 6 6 6 6 6 6 6 6 6 6 1 1 1 1 1 1 1 1 1 1 1 1 1 1
symmnumber: 1
zpe: 702971.8 jmol-1
zpe.correction: 0.267748 hartree
zpe.thermalcorrener: 0.285718 hartree
zpe.thermalcorrenthalpy: 0.286662 hartree
zpe.thermalcorrgfe: 0.219962 hartree
zpe.sumelectzpe: -910.807723 hartree
zpe.sumelectthermal: -910.789753 hartree
zpe.sumelectthermalent: -910.788809 hartree
zpe.sumelectthermalfe: -910.855510 hartree
dipole: 5.9830 -4.3661 -0.0374
dipole: 7.4068
quadrupole: -86.4789 -121.0341 -124.7012
quadrupole: 4.7719 -0.9562 3.3653
quadrupole: 24.2592 -10.2961 -13.9631 4.7719 -0.9562 3.3653
hfenergy: -911.0754711 hartree
pointgroup: C01 [X(C16H14N4O1)]
dipole: 2.3576217 1.2813579 -1.1364177 debye
polarizability: 523.6977909|-3.0000666|165.395308|-13.5842851|-50.2269456|131.0619654 unknown
InChI: InChI=1S/C16H14N4O/c1-12-15(18-17-13-8-4-2-5-9-13)16(21)19-20(12)14-10-6-3-7-11-14/h2-11,19H,1H3
charge 0 multiplicity 1
35 atoms
O  -0.29006 -1.897928 2.292804
N  2.10482 -0.061742 0.444004
N  1.717549 -1.10751 1.320098
N  -1.452625 0.254846 0.08116
N  -2.452052 -0.365237 0.672708
C  0.952754 0.485143 -0.103063
C  3.476083 0.077831 0.071243
C  -0.174942 -0.13066 0.479719
C  0.285641 -1.143011 1.467333
C  0.948967 1.506552 -1.199305
C  4.014165 1.359084 -0.216289
C  4.310368 -1.070924 0.035149
C  5.376059 1.479697 -0.561879
C  5.674254 -0.930784 -0.294876
C  6.213874 0.340604 -0.599798
C  -3.746486 0.059669 0.221546
C  -3.996374 1.061794 -0.760198
C  -4.836672 -0.606879 0.842296
C  -5.322348 1.381894 -1.107062
C  -6.16266 -0.280378 0.488456
C  -6.410088 0.714456 -0.486856
H  2.358463 -1.361304 2.07658
H  1.703914 1.285286 -1.974197
H  1.141387 2.52612 -0.816902
H  -0.056175 1.50667 -1.648941
H  3.384975 2.250178 -0.143271
H  3.883975 -2.059348 0.233544
H  5.786873 2.470633 -0.782588
H  6.312666 -1.820141 -0.326164
H  7.272634 0.44295 -0.858481
H  -3.1447 1.566744 -1.226474
H  -4.609153 -1.370642 1.593144
H  -5.518318 2.152554 -1.861792
H  -6.999755 -0.797593 0.970008
H  -7.439317 0.970272 -0.763056
