program: Gaussian 09
title: 000292089
version: EM64L-G09RevD.01
frameworkgroup: C1[X(C18H17NO2)]
method: RPBEPBE
basis: SDD
operation: Freq
keyword: #p
keyword: freq=noraman
keyword: PBEPBE/SDD
title: #p freq=noraman PBEPBE/SDD
converged: YES YES NO NO
title: Mulliken charges:
elementType: O O N C C C C C C C C C C C C C C C C C C H H H H H H H H H H H H H H H H H
charge: -0.257332 -0.249449 -0.446182 0.520064 0.296467 0.470585 0.440922 -0.383390 -0.387313 -0.332127 -0.356738 -0.355367 -0.462929 -0.293082 0.091764 -0.437715 -0.358925 -0.310409 -0.808185 0.222614 -0.780237 0.228366 0.240953 0.216599 0.278399 0.310146 0.221571 0.272378 0.231760 0.231985 0.207829 0.234791 0.233930 0.226442 0.305365 0.261632 0.260950 0.213867
chargesum: 0.00000
title: Mulliken charges with hydrogens summed into heavy atoms:
elementType: O O N C C C C C C C C C C C C C C C C C C
charge: -0.257332 -0.249449 -0.140817 0.520064 0.296467 0.470585 0.440922 -0.155024 -0.146360 -0.115528 -0.078339 -0.045221 -0.241358 -0.020704 0.091764 -0.205955 -0.126940 -0.102580 -0.113022 0.222614 -0.043788
polarizability: 4.98073926e+02 5.25121020e-02 2.20991441e+02 1.36256518e+00 -3.18053627e-01 9.09248120e+01
1716.lowfreq: -0.0009 -0.0004 0.0009 3.6429 5.2585 8.7970 15.9367 26.3027 31.7457
frequency: 14.9758 26.0826 31.6935 36.1439 36.5825 50.3363 70.8194 94.3846 112.9630 118.6264 147.5046 177.2741 192.3926 227.1044 272.0200 283.5162 329.8133 345.1339 355.2235 380.3772 402.4708 413.9768 415.8700 478.1793 503.0205 524.0701 528.8739 587.1634 595.2936 628.0090 634.7808 639.4634 654.0257 674.9265 729.4863 752.2257 756.4334 803.1732 825.3270 832.9954 835.8271 856.3760 864.7676 881.2311 889.5635 931.2520 955.5921 961.1632 984.1589 992.8825 998.8387 1003.8718 1006.5694 1009.6789 1015.1961 1034.0200 1039.5569 1048.3939 1121.0255 1126.6919 1187.0186 1194.2885 1215.3672 1219.8468 1224.0431 1230.1626 1269.7237 1294.1525 1306.1815 1326.0575 1340.1789 1370.3597 1374.1731 1389.8538 1399.3394 1411.0498 1426.5575 1448.6509 1469.4345 1470.0219 1471.4778 1487.6542 1501.3943 1509.3383 1516.4428 1577.0479 1580.5401 1616.0570 1620.8036 1629.0387 1637.5324 2978.0260 2996.1512 3056.2617 3087.0617 3093.5486 3097.0714 3100.0407 3111.9401 3122.1079 3124.9798 3140.8278 3144.0467 3147.5453 3157.0731 3161.3658 3195.6471 3531.1538
redmass: 3.6058 3.7053 1.3382 1.3777 2.5099 3.1358 4.0784 4.2077 4.4326 5.2963 2.9838 6.9880 4.5280 3.5458 5.3912 3.8840 6.0261 3.4239 4.2108 3.7099 2.7977 2.8964 4.9210 2.8046 4.5298 2.4289 4.5391 5.6712 3.1442 6.0425 6.9380 5.9966 1.1833 3.5572 2.7539 3.0315 5.6521 5.2430 1.4242 5.2346 1.4938 1.3344 1.5023 4.4321 1.9601 6.4130 1.3643 1.3900 1.5081 1.6735 1.3279 1.3593 2.5609 3.0353 1.2304 2.9918 1.6348 1.5765 1.3463 1.3683 1.2003 1.1369 2.4855 2.8700 2.2663 1.8917 1.9104 1.4233 1.6404 1.7586 1.7886 3.7262 3.9380 1.2199 1.2568 3.6046 4.1586 1.0453 1.0458 1.0941 1.1496 2.1061 2.8866 3.6466 4.1671 5.8758 5.4787 5.5369 6.0045 5.2603 5.7276 1.0374 1.0363 1.0972 1.0990 1.0891 1.0995 1.0991 1.0884 1.0892 1.0884 1.0934 1.0936 1.0921 1.0927 1.0932 1.0948 1.0764
irintensity: 0.4846 7.6788 0.0134 0.5243 0.9663 1.3202 7.2014 0.2269 0.5756 2.5457 0.1176 0.2393 3.2393 0.7259 8.6900 3.0979 5.9600 2.1922 10.6339 0.0769 0.1037 0.0009 0.3258 6.3979 5.8065 43.6667 2.5410 35.4054 0.7402 7.6229 1.2926 10.9079 55.2032 3.9998 1.1681 5.7480 16.9557 0.1603 90.8392 1.1480 1.0520 53.1268 10.1736 2.7105 0.0969 5.7628 4.3569 0.4964 0.9214 26.4500 10.8262 1.5065 0.6834 41.8723 35.5412 100.7121 15.5168 13.8975 30.1218 19.9866 229.4373 14.5418 35.7285 175.9981 83.8307 78.6546 75.3488 35.6262 108.9197 45.3506 48.8338 336.0646 207.4542 47.2597 13.9519 11.7647 74.5135 15.7524 13.5237 22.8557 1.9366 118.6258 112.7367 561.9182 50.3669 150.7265 27.3065 353.2838 44.0910 148.3888 129.1389 35.0617 14.8783 18.5422 17.7968 1.1543 13.9390 11.1572 25.4785 18.9086 26.4051 20.1252 2.1619 0.4779 29.4635 10.5366 4.3766 17.9926
temp: 298.150 k
press: 1.00000 atm
elementType: 8 8 7 6 6 6 6 6 6 6 6 6 6 6 6 6 6 6 6 6 6 1 1 1 1 1 1 1 1 1 1 1 1 1 1 1 1 1
symmnumber: 1
zpe: 790719.8 jmol-1
zpe.correction: 0.301169 hartree
zpe.thermalcorrener: 0.321234 hartree
zpe.thermalcorrenthalpy: 0.322178 hartree
zpe.thermalcorrgfe: 0.248064 hartree
zpe.sumelectzpe: -899.852262 hartree
zpe.sumelectthermal: -899.832197 hartree
zpe.sumelectthermalent: -899.831253 hartree
zpe.sumelectthermalfe: -899.905368 hartree
dipole: 3.2732 -0.3133 0.1174
dipole: 3.2903
quadrupole: -69.1945 -127.6645 -129.4619
quadrupole: 30.5478 0.8695 -0.2662
quadrupole: 39.5792 -18.8909 -20.6883 30.5478 0.8695 -0.2662
hfenergy: -900.1534316 hartree
pointgroup: C01 [X(C18H17N1O2)]
dipole: 1.2884073 0.1110045 -0.0584184 debye
polarizability: 498.0411691|-2.159031|220.4961452|-2.9519151|-8.1290253|91.4528647 unknown
InChI: InChI=1S/C18H17NO2/c1-13-3-8-16(9-4-13)18(21)12-7-15-5-10-17(11-6-15)19-14(2)20/h3-12,19H,1-2H3
charge 0 multiplicity 1
38 atoms
O  -2.57645 -2.435968 0.241617
O  5.68675 2.332992 -0.041677
N  5.634006 -0.015023 0.044225
C  1.459991 -0.971218 0.118729
C  -3.619392 -0.267418 0.108354
C  4.23941 -0.283493 0.068325
C  -6.008615 1.321332 0.016775
C  1.889359 0.388064 0.067085
C  2.469845 -1.977743 0.145665
C  -3.551013 1.143654 -0.040733
C  -4.90447 -0.870158 0.209376
C  3.248148 0.739783 0.041978
C  3.832894 -1.645568 0.121097
C  0.055203 -1.380179 0.146038
C  -2.416162 -1.169647 0.160125
C  -4.728263 1.9211 -0.085979
C  -6.07321 -0.09232 0.165748
C  -1.055678 -0.575406 0.119089
C  -7.275874 2.154339 -0.031505
C  6.290306 1.221823 -0.008798
C  7.814486 1.130424 -0.028128
H  1.145312 1.191702 0.047027
H  2.171072 -3.031791 0.186312
H  -2.586658 1.653637 -0.129266
H  -4.946748 -1.958692 0.32125
H  3.564143 1.783396 0.002549
H  4.587974 -2.442011 0.1427
H  -0.144502 -2.461414 0.194357
H  -4.652612 3.008747 -0.202956
H  -7.053022 -0.578998 0.247687
H  -0.95602 0.513345 0.072711
H  -7.911281 1.865142 -0.88998
H  -7.883314 2.010878 0.881782
H  -7.05232 3.230646 -0.124423
H  6.236711 -0.840845 0.066942
H  8.217938 1.715668 0.815797
H  8.189139 1.596866 -0.955701
H  8.205923 0.10015 0.034105
