program: Gaussian 09
title: 000292120
version: EM64L-G09RevD.01
frameworkgroup: C1[X(C16H17N2O7P)]
method: RPBEPBE
basis: SDD
operation: Freq
keyword: #p
keyword: freq=noraman
keyword: PBEPBE/SDD
title: #p freq=noraman PBEPBE/SDD
converged: YES YES NO NO
title: Mulliken charges:
elementType: P O O O O O O O N N C C C C C C C C C C C C C C C C H H H H H H H H H H H H H H H H H
charge: 1.383514 -0.263346 -0.501275 -0.436637 -0.563732 -0.564775 -0.253945 -0.239328 -0.168949 -0.406469 -0.097400 -0.023411 -0.506091 -0.027041 -0.350692 -0.219176 0.217669 0.240784 0.096783 0.392848 -0.761821 -0.345167 -0.377547 -0.200574 -0.191849 -0.245592 0.280705 0.211499 0.293946 0.250123 0.304261 0.269309 0.228169 0.263940 0.363658 0.251694 0.207035 0.248825 0.293499 0.245040 0.235025 0.232535 0.233956
chargesum: 0.00000
title: Mulliken charges with hydrogens summed into heavy atoms:
elementType: P O O O O O O O N N C C C C C C C C C C C C C C C C
charge: 1.383514 -0.263346 -0.501275 -0.436637 -0.563732 -0.564775 -0.253945 -0.239328 -0.168949 -0.042811 0.183305 0.188088 0.037978 0.277220 0.146786 0.044764 0.217669 0.240784 0.096783 0.392848 -0.054266 -0.051668 -0.132507 0.034452 0.040686 -0.011636
polarizability: 3.43697210e+02 7.77146236e+00 2.24748725e+02 -5.97204413e+00 -5.37452657e+00 1.30364906e+02
1716.lowfreq: -4.0566 -2.3343 -0.0007 -0.0005 0.0002 9.7871 13.1359 16.0185 18.9114
frequency: 12.5920 15.8257 18.7627 30.3806 40.8700 49.2661 87.1266 92.8062 108.6503 122.5553 127.1225 166.5236 175.7044 201.9205 222.6874 232.9752 241.6370 248.2514 265.0904 277.7271 308.7426 322.3823 362.9564 369.5956 380.1211 390.6755 401.3860 409.7646 422.6379 466.6993 469.9005 491.1721 535.2903 540.6904 587.9464 590.6198 609.6716 641.1187 648.8303 674.2572 687.6609 692.5549 698.7580 717.7622 727.0920 752.6557 762.5120 780.7967 782.5393 803.3029 827.4305 835.3953 835.8965 845.4901 865.8587 878.0173 914.1203 919.6680 932.1451 965.6746 971.0300 985.6418 992.0651 1008.7864 1022.1040 1023.7818 1043.7822 1050.6001 1068.3727 1079.0931 1092.1919 1093.4001 1126.8637 1141.1909 1160.4415 1171.7931 1176.4623 1189.5297 1222.1945 1229.6963 1238.8829 1259.4381 1273.0373 1297.9022 1309.2623 1315.5981 1318.0761 1321.3494 1339.6989 1366.7847 1367.7209 1377.4324 1381.3105 1407.2150 1427.8583 1435.3040 1441.9310 1448.3458 1449.6978 1472.4824 1472.7579 1595.2703 1603.5505 1619.2808 1642.5337 1670.1741 2935.6807 2987.7370 3013.0121 3023.5457 3062.0960 3069.7257 3083.8499 3094.9412 3109.6880 3116.6683 3134.6135 3143.8737 3156.7515 3164.6256 3169.5628 3174.9220 3523.5006
redmass: 6.4629 6.9156 4.4692 4.5255 7.3648 7.5746 6.4073 6.2090 2.8451 1.6496 3.0719 7.0684 5.9960 7.7583 4.9603 4.3450 7.1322 4.0611 5.2715 3.7182 4.8750 5.4251 5.6164 4.7757 7.9042 5.2681 5.6805 2.9376 6.4266 6.7174 3.8455 3.4246 6.0568 5.3728 6.4618 7.1637 6.7725 4.6823 4.8641 9.3304 5.2330 2.5070 2.7639 4.0340 6.1091 6.9736 1.5249 3.0600 3.1353 5.9177 7.4919 1.2682 3.1586 3.1135 4.4077 1.4123 1.4170 2.7559 2.9052 2.3276 1.3645 6.2743 1.3128 2.3718 2.0788 1.9927 2.2040 1.4833 3.4490 1.6312 2.6443 8.2728 2.7647 4.7683 2.1006 1.2041 1.3555 1.2601 4.3976 1.1771 1.7113 1.9449 1.2901 1.2916 1.5265 1.3240 1.5509 1.3594 1.9893 1.5388 1.3597 2.0440 8.9513 1.2611 2.4097 1.0826 2.2497 1.0950 1.0436 1.8058 1.2034 6.1651 6.6132 6.3073 8.9693 6.2691 1.0827 1.0362 1.0644 1.0651 1.0883 1.0975 1.0874 1.1006 1.1013 1.1000 1.0852 1.0891 1.0931 1.0967 1.0927 1.1016 1.0770
irintensity: 0.0019 0.3366 0.1447 1.0587 1.6606 1.8828 1.1922 0.5375 0.6392 1.0009 1.2464 3.9548 9.7573 2.6953 3.0834 3.5787 11.0663 1.7220 2.1921 2.4122 23.4418 14.4422 13.9701 4.2063 8.8802 11.8967 57.7541 1.0410 39.8591 11.1043 1.7792 16.3554 8.7766 13.7980 17.9200 3.8246 26.1491 13.5930 32.3689 130.4741 56.2590 57.2915 1.9630 7.3224 21.5173 11.5035 96.7493 102.4547 123.2925 18.8920 355.0860 2.9051 2.9512 7.2223 65.7376 24.8529 8.5373 18.7884 144.9495 98.8917 0.1762 1.0109 1.1835 193.6994 36.9778 18.5571 23.8961 5.7816 39.5963 50.6659 8.0812 115.5732 44.8841 9.2220 228.6536 79.9585 27.3028 34.7961 11.4586 6.7649 19.1342 155.0623 21.9771 9.3385 62.6728 3.5024 27.7387 18.9950 58.6067 38.0878 6.8008 21.8760 1.3461 20.5971 69.8446 9.1514 12.2040 22.4554 8.9277 98.4490 37.0345 64.6182 31.0486 214.5998 269.1462 564.8305 28.6565 21.2776 31.9449 6.8794 20.3719 12.2144 2.0281 15.0699 3.6154 3.6290 0.7980 11.6579 13.0694 13.2208 5.5363 15.0027 64.1398
temp: 298.150 k
press: 1.00000 atm
elementType: 15 8 8 8 8 8 8 8 7 7 6 6 6 6 6 6 6 6 6 6 6 6 6 6 6 6 1 1 1 1 1 1 1 1 1 1 1 1 1 1 1 1 1
symmnumber: 1
zpe: 838911.0 jmol-1
zpe.correction: 0.319524 hartree
zpe.thermalcorrener: 0.343310 hartree
zpe.thermalcorrenthalpy: 0.344255 hartree
zpe.thermalcorrgfe: 0.262301 hartree
zpe.sumelectzpe: -1595.296128 hartree
zpe.sumelectthermal: -1595.272342 hartree
zpe.sumelectthermalent: -1595.271398 hartree
zpe.sumelectthermalfe: -1595.353351 hartree
dipole: -3.4590 8.1189 -1.8559
dipole: 9.0181
quadrupole: -178.1891 -160.6695 -161.9137
quadrupole: -5.6792 -3.2445 0.3993
quadrupole: -11.2650 6.2546 5.0104 -5.6792 -3.2445 0.3993
hfenergy: -1595.6156527 hartree
pointgroup: C01 [X(C16H17N2O7P1)]
dipole: 1.4242299 2.9003682 1.4654648 debye
polarizability: 343.077159|-6.5108281|216.4619404|-12.565048|27.6567692|139.2717412 unknown
InChI: InChI=1S/C16H17N2O7P/c1-10-8-18(16(20)17-15(10)19)14-7-12-13(23-14)9-22-26(21,25-12)24-11-5-3-2-4-6-11/h2-6,8,12-14,17H,7,9H2,1H3
charge 0 multiplicity 1
43 atoms
P  2.334405 -1.090167 -0.582381
O  -1.21774 0.461123 -0.912046
O  0.984452 -1.250079 0.472468
O  1.764639 0.021959 -1.781228
O  3.33037 -0.107513 0.467782
O  2.911872 -2.433508 -1.161336
O  -3.797266 -2.563433 -0.445517
O  -7.358256 0.400764 0.184023
N  -3.304644 -0.300294 0.015521
N  -5.541969 -1.031028 -0.133568
C  0.277444 -0.012248 0.924991
C  -0.011655 0.985636 -0.229883
C  -1.125618 -0.489799 1.311796
C  -1.856206 -0.569967 -0.053198
C  1.097048 1.246023 -1.260074
C  -3.774814 0.992738 0.267977
C  -4.189095 -1.388484 -0.212692
C  -5.107418 1.317692 0.34326
C  -6.103337 0.251439 0.139485
C  4.717356 0.166558 0.24339
C  -5.612232 2.715031 0.602196
C  5.573973 -0.725832 -0.438162
C  5.19088 1.372429 0.802146
C  6.93846 -0.379563 -0.566968
C  6.559902 1.694281 0.672194
C  7.436748 0.823148 -0.015862
H  0.860853 0.439164 1.745177
H  -0.25631 1.970198 0.229318
H  -1.091936 -1.465828 1.818404
H  -1.611183 0.246059 1.978506
H  -1.740725 -1.55845 -0.524454
H  0.665685 1.712004 -2.15951
H  1.862568 1.912583 -0.819301
H  -2.995382 1.752655 0.365424
H  -6.207564 -1.795253 -0.289284
H  -6.248498 3.060385 -0.232668
H  -4.780349 3.428635 0.730945
H  -6.246878 2.740826 1.506393
H  5.190695 -1.6639 -0.852518
H  4.496597 2.031198 1.332823
H  7.612101 -1.061638 -1.096619
H  6.937195 2.626453 1.106514
H  8.496631 1.077906 -0.118273
