program: Gaussian 09
title: 000292069
version: EM64L-G09RevD.01
frameworkgroup: C1[X(C12H11N3O2S)]
method: RPBEPBE
basis: SDD
operation: Freq
keyword: #p
keyword: freq=noraman
keyword: PBEPBE/SDD
title: #p freq=noraman PBEPBE/SDD
converged: YES YES NO NO
title: Mulliken charges:
elementType: S O O N N N C C C C C C C C C C C C H H H H H H H H H H H
charge: 0.217904 -0.286793 -0.191734 -0.359398 -0.697222 0.023830 0.346166 -0.658016 0.170766 -0.540065 -0.372757 0.164461 0.503078 -0.214314 -0.404343 -0.128402 -0.485491 -0.167270 0.279983 0.279219 0.273432 0.251934 0.229730 0.226580 0.383347 0.317445 0.311831 0.266617 0.259483
chargesum: 0.00000
title: Mulliken charges with hydrogens summed into heavy atoms:
elementType: S O O N N N C C C C C C C C C C C C
charge: 0.217904 -0.286793 -0.191734 0.023948 -0.067946 0.023830 0.346166 -0.098814 0.170766 -0.266633 -0.120823 0.164461 0.503078 0.015417 -0.177763 -0.128402 -0.218874 0.092213
polarizability: 2.85647421e+02 -1.01951829e+01 1.98564640e+02 4.81691244e-01 3.23901333e-01 7.01676757e+01
1716.lowfreq: -6.4912 -5.1003 -0.0020 -0.0014 -0.0003 3.3481 10.7183 17.5375 28.7736
frequency: 10.4331 17.4540 28.7298 54.7963 72.6175 101.4155 129.8360 152.9866 181.9329 215.7653 260.1262 275.6030 281.6828 371.5247 388.3255 403.8348 404.6467 409.1570 458.9855 472.3424 508.7242 520.1537 538.3587 557.0492 567.5265 599.1608 650.1966 652.6712 684.9212 689.2078 710.2928 759.9517 787.3027 816.7463 834.7075 862.1583 871.1744 880.3707 894.1728 907.9729 922.7483 962.0542 976.0835 980.0645 1004.8735 1035.9787 1061.7210 1094.2926 1107.7956 1171.4579 1188.0543 1195.1385 1213.6958 1248.9309 1278.9453 1302.3366 1309.5359 1338.5126 1406.0394 1408.8220 1455.2820 1462.7049 1489.4432 1526.6141 1560.2703 1577.8939 1587.6019 1625.7815 1646.2495 1654.4102 2997.4246 3044.6830 3124.9347 3140.5352 3143.0646 3148.4701 3171.7039 3200.2204 3252.6421 3565.5136 3705.1200
redmass: 10.3381 5.5243 5.6900 6.8971 3.1537 4.8737 6.6868 5.0464 7.4208 3.4700 6.0894 11.7128 5.9219 8.0203 1.2098 3.0274 2.6290 1.2073 6.1628 2.7605 4.2542 6.5448 10.1744 6.8937 4.0072 4.9541 7.3374 4.5334 7.5569 1.8671 1.2904 6.9744 1.5704 6.3339 6.4382 1.3239 5.8327 1.4837 1.5527 3.9202 1.3724 1.7981 1.3633 6.0603 1.8597 1.9076 1.7420 1.8961 1.5319 2.4668 1.1127 1.1264 2.7164 2.8538 1.6832 1.6961 1.6737 2.4141 1.1649 5.7944 3.6816 5.2461 2.7803 2.9790 9.0221 3.5506 5.5570 3.9918 1.3383 3.1933 1.0615 1.0956 1.0880 1.0850 1.0913 1.0917 1.0972 1.0920 1.1009 1.0452 1.1041
irintensity: 0.4899 1.0897 1.3622 1.4333 13.3574 1.5271 1.7735 1.4937 5.2221 3.4755 18.9377 3.7080 1.5009 5.8226 42.2004 26.0882 39.7985 227.8692 1.0152 0.9520 1.2803 24.7964 16.7765 41.4649 4.9866 18.4288 10.8104 1.1035 5.2247 33.8946 76.7578 21.0377 47.1516 10.8916 1.5422 2.8867 40.0586 8.3940 0.3459 1.1559 74.8660 41.6626 0.2295 16.5138 14.7156 34.1929 2.5205 38.0736 12.8192 13.1024 3.6049 3.4033 218.4460 55.6325 1.7493 1.1982 45.6912 222.1833 59.8821 9.1034 263.1880 0.4550 49.6580 1058.3657 219.4606 16.4319 45.8238 87.9537 357.5384 78.0314 13.1697 0.3523 12.6571 1007.9061 6.7236 18.2151 8.3945 4.8911 1.3272 81.2981 24.0686
temp: 298.150 k
press: 1.00000 atm
elementType: 16 8 8 7 7 7 6 6 6 6 6 6 6 6 6 6 6 6 1 1 1 1 1 1 1 1 1 1 1
symmnumber: 1
zpe: 557894.4 jmol-1
zpe.correction: 0.212491 hartree
zpe.thermalcorrener: 0.229122 hartree
zpe.thermalcorrenthalpy: 0.230066 hartree
zpe.thermalcorrgfe: 0.164273 hartree
zpe.sumelectzpe: -1175.362694 hartree
zpe.sumelectthermal: -1175.346062 hartree
zpe.sumelectthermalent: -1175.345118 hartree
zpe.sumelectthermalfe: -1175.410911 hartree
dipole: -7.4325 -3.7079 0.0591
dipole: 8.3063
quadrupole: -72.7385 -110.7935 -116.6008
quadrupole: -4.4763 0.1346 0.1946
quadrupole: 27.3058 -10.7492 -16.5566 -4.4763 0.1346 0.1946
hfenergy: -1175.5751845 hartree
pointgroup: C01 [X(C12H11N3O2S1)]
dipole: -2.9841798 1.3299441 0.0733549 debye
polarizability: 284.5926064|13.7054148|198.3780018|2.8926601|12.569148|71.4091289 unknown
InChI: InChI=1S/C12H11N3O2S/c13-9-3-1-2-8(6-9)10(16)7-11(17)15-12-14-4-5-18-12/h1-6,15H,7,13H2
charge 0 multiplicity 1
29 atoms
S  3.932952 2.046799 0.150086
O  -0.278716 1.051862 -0.02481
O  2.18734 -2.431331 -0.277985
N  2.124479 -0.072904 -0.101825
N  -5.232988 2.121067 0.038654
N  4.517769 -0.566195 -0.149996
C  -2.315884 -0.215397 -0.154936
C  0.006456 -1.375851 -0.249504
C  -0.827696 -0.096463 -0.133917
C  -3.071895 0.979242 -0.050948
C  -2.975797 -1.47111 -0.274875
C  1.554222 -1.347459 -0.209585
C  -4.491328 0.947575 -0.06389
C  -4.386047 -1.503485 -0.288042
C  -5.141511 -0.319137 -0.184602
C  3.47895 0.239798 -0.059746
C  5.646601 1.50553 0.090359
C  5.728386 0.133698 -0.066231
H  -0.262094 -1.887998 -1.194477
H  -0.302955 -2.078543 0.548142
H  -2.528675 1.926768 0.039777
H  -2.412472 -2.404591 -0.356447
H  -4.906857 -2.4627 -0.379961
H  -6.237344 -0.366795 -0.196558
H  1.419406 0.696295 -0.04471
H  -4.771883 3.022131 0.125307
H  -6.248475 2.100663 0.030308
H  6.451209 2.232071 0.173821
H  6.659546 -0.430437 -0.129307
