program: Gaussian 09
title: 000292070
version: EM64L-G09RevD.01
frameworkgroup: C1[X(C14H11N3O4)]
method: RPBEPBE
basis: SDD
operation: Freq
keyword: #p
keyword: freq=noraman
keyword: PBEPBE/SDD
title: #p freq=noraman PBEPBE/SDD
converged: YES YES NO NO
title: Mulliken charges:
elementType: O O O O N N N C C C C C C C C C C C C C C H H H H H H H H H H H
charge: -0.265792 -0.247186 -0.212010 -0.210443 -0.401117 -0.052183 0.030681 -0.644981 0.297763 0.173381 0.166169 0.166111 -0.326082 -0.339451 -0.247958 -0.271573 -0.243254 -0.222537 0.364387 -0.215508 -0.424897 0.281882 0.281828 0.403845 0.251122 0.283322 0.316542 0.292463 0.238516 0.241428 0.241099 0.294432
chargesum: 0.00000
title: Mulliken charges with hydrogens summed into heavy atoms:
elementType: O O O O N N N C C C C C C C C C C C C C C
charge: -0.265792 -0.247186 -0.212010 -0.210443 0.002728 -0.052183 0.030681 -0.081271 0.297763 0.173381 0.166169 0.166111 -0.074959 -0.056129 0.068584 0.020890 -0.004738 0.018892 0.364387 0.025591 -0.130465
polarizability: 3.57435472e+02 1.92099204e+01 1.92479401e+02 6.71996305e-02 -8.47333370e-02 7.38365020e+01
1716.lowfreq: -4.4152 -0.0009 0.0003 0.0008 0.9482 4.8233 16.8858 28.0520 50.2444
frequency: 16.3099 28.0298 50.2158 51.3852 59.8491 79.8998 89.5462 136.5842 148.0328 150.0027 170.6990 227.3284 302.8439 307.2346 328.1203 378.3986 397.0707 399.2063 403.0240 419.6515 463.1660 495.3812 505.6403 532.5777 584.8916 613.1329 617.5437 637.0945 651.0895 679.9353 694.2717 698.2652 770.8801 772.6899 773.4124 806.3589 858.5204 859.3167 879.5222 918.6985 933.0125 953.6075 959.0385 983.8830 989.6324 993.7774 995.4234 1004.4591 1014.5697 1015.3211 1028.5521 1091.1900 1102.1074 1131.9529 1176.9283 1192.2055 1203.4250 1206.4645 1216.5932 1237.8824 1266.9429 1288.8083 1314.6892 1330.3875 1352.0494 1360.0744 1390.7077 1391.9046 1411.3290 1437.6216 1451.2602 1482.0534 1524.0942 1555.7217 1565.2280 1583.2675 1592.5841 1610.5126 1623.2175 2996.2312 3043.3859 3135.3543 3143.4563 3154.0703 3164.2344 3172.8370 3174.4342 3179.9811 3198.5585 3202.5244
redmass: 6.7655 4.3526 7.6236 11.4172 9.6542 4.5607 3.4809 6.5102 5.3933 8.9366 5.1810 8.5061 6.1274 8.3642 7.0271 9.2068 2.8583 11.2641 2.9562 3.8873 8.2745 2.8629 7.6708 2.7366 6.1776 6.4753 9.0042 4.6252 7.0597 7.1923 1.7894 6.9137 5.5025 8.8869 1.7391 6.4308 1.2526 5.1949 1.4269 1.9111 7.9615 1.4327 1.5352 3.8828 6.2142 1.2617 1.3775 3.4868 1.3107 1.3539 1.9910 1.5991 2.3131 1.6118 1.0784 1.2111 2.4820 1.1254 7.3056 2.2920 2.7555 1.5692 1.6465 1.7503 5.5214 6.4401 6.6932 4.7253 1.1197 2.2850 2.7430 2.2044 2.7955 6.7815 6.7682 5.0997 6.5999 5.8773 4.2806 1.0614 1.0959 1.0855 1.0883 1.0926 1.0963 1.0929 1.1014 1.0915 1.0817 1.0970
irintensity: 0.0424 0.6740 0.0559 0.1324 2.2721 0.0021 18.3629 0.9101 0.0835 8.3071 2.5058 5.0865 0.9252 1.4681 34.4639 8.9484 0.2423 2.3389 0.3364 3.7574 14.1273 10.3267 3.1307 0.0240 36.2668 0.7172 1.3463 5.1508 39.4193 14.1489 53.7019 13.8660 1.2383 20.8720 56.6429 6.0442 0.5765 9.2584 47.9229 0.0548 9.5863 5.9453 15.3269 11.4898 5.4602 79.6301 5.1656 45.3946 0.0059 0.0462 0.6961 10.6976 14.5280 32.9759 9.9446 73.5052 5.1262 3.0658 880.1463 46.8445 32.9392 33.7437 58.4024 123.9511 59.6759 6.8620 98.3329 129.3950 38.6814 46.2571 9.1184 31.2965 1535.7077 3.1930 76.9217 102.5177 87.6385 4.1713 169.2262 9.5150 0.1461 0.4090 3.5119 12.9465 12.1889 0.9933 34.6364 2.0449 901.6440 5.5420
temp: 298.150 k
press: 1.00000 atm
elementType: 8 8 8 8 7 7 7 6 6 6 6 6 6 6 6 6 6 6 6 6 6 1 1 1 1 1 1 1 1 1 1 1
symmnumber: 1
zpe: 607005.3 jmol-1
zpe.correction: 0.231196 hartree
zpe.thermalcorrener: 0.248970 hartree
zpe.thermalcorrenthalpy: 0.249914 hartree
zpe.thermalcorrgfe: 0.182143 hartree
zpe.sumelectzpe: -1003.701030 hartree
zpe.sumelectthermal: -1003.683256 hartree
zpe.sumelectthermalent: -1003.682311 hartree
zpe.sumelectthermalfe: -1003.750082 hartree
dipole: 10.4665 1.3682 0.0047
dipole: 10.5555
quadrupole: -125.7802 -124.2497 -121.6881
quadrupole: -5.8581 -0.0517 0.0622
quadrupole: -1.8742 -0.3437 2.2179 -5.8581 -0.0517 0.0622
hfenergy: -1003.9322258 hartree
pointgroup: C01 [X(C14H11N3O4)]
dipole: -4.1118696 0.4085886 0.4145702 debye
polarizability: 356.8893781|-12.4546977|155.9470928|-18.2292312|54.9174022|110.9149039 unknown
InChI: InChI=1S/C14H11N3O4/c18-12(10-4-2-1-3-5-10)8-14(19)16-13-7-6-11(9-15-13)17(20)21/h1-7,9,16H,8H2
charge 0 multiplicity 1
32 atoms
O  -1.773293 -1.067514 -0.564935
O  0.165382 2.136378 1.49356
O  6.832925 0.38517 0.108802
O  6.36683 -1.481231 -1.125498
N  0.459143 0.199999 0.192386
N  2.290201 -0.944717 -0.635107
N  6.006812 -0.45437 -0.426528
C  -1.838504 0.978632 0.789379
C  -3.968563 -0.296795 0.027895
C  -2.477833 -0.195322 0.03835
C  -0.308129 1.151262 0.853002
C  1.8574 0.133446 0.100944
C  -4.807637 0.648864 0.681377
C  -4.560542 -1.38831 -0.667778
C  2.744884 1.075123 0.702046
C  4.124522 0.883737 0.529522
C  -6.209279 0.502511 0.637803
C  -5.959996 -1.531824 -0.709185
C  4.566682 -0.225879 -0.227258
C  -6.788135 -0.586271 -0.056203
C  3.62331 -1.116822 -0.793645
H  -2.233887 1.927134 0.375755
H  -2.18592 0.964663 1.840926
H  -0.072178 -0.556059 -0.292185
H  -4.379044 1.498329 1.223352
H  -3.899572 -2.105719 -1.164747
H  2.339499 1.910646 1.273826
H  4.857224 1.568661 0.964149
H  -6.850451 1.23299 1.142098
H  -6.408016 -2.374428 -1.246089
H  -7.877568 -0.697129 -0.08794
H  3.955533 -1.977353 -1.380773
