program: Gaussian 09
title: 000292064
version: EM64L-G09RevD.01
frameworkgroup: C1[X(C14H12ClNS)]
method: RPBEPBE
basis: SDD
operation: Freq
keyword: #p
keyword: freq=noraman
keyword: PBEPBE/SDD
title: #p freq=noraman PBEPBE/SDD
converged: YES YES NO NO
title: Mulliken charges:
elementType: Cl S N C C C C C C C C C C C C C C H H H H H H H H H H H H
charge: -0.052383 0.014003 -0.171986 0.462332 -0.475496 0.443868 -0.649637 -0.361433 -0.317516 -0.328987 -0.346124 -0.207956 -0.208407 -0.223932 -0.206362 -0.237086 -0.101214 0.251189 0.236892 0.262795 0.243081 0.250112 0.244744 0.272052 0.229505 0.230203 0.257899 0.257772 0.232072
chargesum: 0.00000
title: Mulliken charges with hydrogens summed into heavy atoms:
elementType: Cl S N C C C C C C C C C C C C C C
charge: -0.052383 0.014003 -0.171986 0.462332 -0.475496 0.443868 0.101239 -0.118352 -0.067405 -0.084243 -0.074072 0.021549 0.021796 0.033967 0.051411 -0.005014 -0.101214
polarizability: 2.96202424e+02 -1.02667835e+01 1.45163720e+02 2.84631825e+00 1.00549580e+01 1.29669201e+02
1716.lowfreq: -13.7155 -11.0104 -2.2843 -0.0013 -0.0010 0.0016 19.2201 30.0073 46.7298
frequency: 17.1410 29.9592 46.7080 60.5282 91.2320 125.4886 141.7760 160.0600 195.0372 207.5025 233.8625 286.5500 329.0330 362.5156 405.3066 407.2080 409.8822 440.4727 472.9084 508.9491 548.9141 597.6503 603.0829 614.3761 637.0619 696.2865 701.8064 717.4357 763.3540 791.8862 828.7603 836.8466 843.7908 918.6729 953.7718 966.2109 973.1340 975.7735 988.4868 995.2483 1005.1490 1013.3073 1028.3574 1071.8565 1076.7233 1103.7345 1111.3538 1119.1634 1172.4954 1178.1544 1182.6688 1243.4374 1252.1622 1290.2282 1307.6838 1358.7063 1377.1796 1381.4521 1392.1027 1437.2766 1443.3954 1465.2397 1471.2247 1478.2727 1492.5625 1571.5025 1590.8135 1595.9921 1607.2725 2983.7056 3065.4679 3129.5733 3129.6571 3136.9970 3139.3306 3148.4564 3154.2055 3157.8868 3170.4629 3170.6385 3175.9676
redmass: 4.2336 5.6254 6.9203 5.1230 5.5340 1.7158 5.1367 1.9643 5.7070 12.3118 4.5328 5.7837 3.0872 5.4779 2.9586 4.0638 4.1207 5.1958 5.1376 3.7116 4.5248 4.5503 6.5684 6.5106 7.0826 1.8820 6.9685 3.7126 1.9402 3.5134 1.2626 1.5835 1.2487 1.4045 1.3611 1.4389 1.4153 4.1669 5.0704 1.3929 3.7092 4.2808 2.3025 2.6499 1.5380 1.4573 1.3056 1.6319 1.0539 1.1140 1.1185 3.8137 5.6366 1.2599 1.3543 5.0656 4.6104 5.2449 3.8356 2.0615 1.3359 1.0538 2.1369 2.2110 1.2352 7.4740 6.3738 6.5156 6.2080 1.0368 1.0998 1.0928 1.0908 1.0882 1.0891 1.0928 1.0889 1.0970 1.0958 1.1017 1.0972
irintensity: 0.2105 0.0779 0.1448 1.9317 2.1681 0.1411 2.4140 0.3242 1.8472 2.6368 1.6918 0.7114 2.2635 1.3885 1.1262 12.2782 7.6666 4.7845 6.0230 16.3918 9.3730 14.2831 1.9453 0.0685 2.5619 40.9733 15.3087 1.3993 45.0985 6.7294 7.0289 67.9972 0.1244 1.1470 0.4113 9.2986 1.0923 52.1202 6.5630 0.3347 14.9458 0.5610 32.1897 54.5355 10.6226 51.1912 2.6781 53.3691 0.0052 2.4629 1.1844 10.6867 73.8733 4.0456 1.1312 4.0704 88.1226 63.2862 19.4285 8.5106 43.8534 19.4351 23.6063 49.3561 57.1471 2.5376 47.6368 4.2450 13.7614 46.1566 17.6318 13.9480 2.1141 2.3428 6.4108 22.8884 0.6710 25.2531 4.6196 15.4254 1.4294
temp: 298.150 k
press: 1.00000 atm
elementType: 17 16 7 6 6 6 6 6 6 6 6 6 6 6 6 6 6 1 1 1 1 1 1 1 1 1 1 1 1
symmnumber: 1
zpe: 575801.5 jmol-1
zpe.correction: 0.219311 hartree
zpe.thermalcorrener: 0.234963 hartree
zpe.thermalcorrenthalpy: 0.235907 hartree
zpe.thermalcorrgfe: 0.173505 hartree
zpe.sumelectzpe: -1452.363161 hartree
zpe.sumelectthermal: -1452.347510 hartree
zpe.sumelectthermalent: -1452.346565 hartree
zpe.sumelectthermalfe: -1452.408967 hartree
dipole: -2.3503 -3.9133 1.4395
dipole: 4.7864
quadrupole: -111.4867 -116.2678 -106.5193
quadrupole: 5.1070 0.3017 5.4543
quadrupole: -0.0621 -4.8432 4.9053 5.1070 0.3017 5.4543
hfenergy: -1452.5824725 hartree
pointgroup: C01 [X(C14H12Cl1N1S1)]
dipole: -0.9876514 -1.2137273 1.0476508 debye
polarizability: 294.6120561|-18.1487461|151.433388|3.3052584|3.1852112|124.9899005 unknown
InChI: InChI=1S/C14H12ClNS/c1-16(13-5-3-2-4-6-13)14(17)11-7-9-12(15)10-8-11/h2-10H,1H3
charge 0 multiplicity 1
29 atoms
Cl 6.077121 -0.777804 -0.181389
S  -0.397684 1.916268 -1.167919
N  -0.815868 -0.266355 0.421194
C  -2.248102 -0.124906 0.192656
C  0.08373 0.554282 -0.237903
C  1.538317 0.201124 -0.158417
C  -0.443644 -1.242793 1.476562
C  -3.067791 0.465544 1.180618
C  -2.815603 -0.632994 -0.997987
C  1.995888 -1.11039 -0.464388
C  2.496977 1.208631 0.127805
C  -4.462937 0.547925 0.974486
C  -4.20969 -0.547111 -1.199865
C  3.374748 -1.412155 -0.486149
C  3.87615 0.916403 0.137254
C  -5.036936 0.041096 -0.213998
C  4.294875 -0.393563 -0.173066
H  -1.085194 -1.081862 2.360384
H  -0.593312 -2.281872 1.128596
H  0.607134 -1.108452 1.769122
H  -2.614927 0.881393 2.087644
H  -2.164746 -1.071505 -1.761484
H  1.275472 -1.894811 -0.721464
H  2.148188 2.226687 0.326535
H  -5.097433 1.014858 1.735622
H  -4.649176 -0.935828 -2.124889
H  3.72416 -2.415249 -0.74644
H  4.6104 1.693081 0.369121
H  -6.118615 0.108056 -0.373541
