program: Gaussian 09
title: 000292065
version: EM64L-G09RevD.01
frameworkgroup: C1[X(C16H16ClNS)]
method: RPBEPBE
basis: SDD
operation: Freq
keyword: #p
keyword: freq=noraman
keyword: PBEPBE/SDD
title: #p freq=noraman PBEPBE/SDD
converged: YES YES NO NO
title: Mulliken charges:
elementType: Cl S N C C C C C C C C C C C C C C C C H H H H H H H H H H H H H H H H
charge: -0.056050 -0.027962 -0.157594 0.450987 -0.357896 -0.487445 -0.479003 0.480255 -0.418524 0.488860 -0.659453 -0.438198 -0.198114 -0.810975 -0.319396 -0.348698 -0.220160 -0.214998 -0.106261 0.250539 0.218411 0.263873 0.248285 0.222757 0.251241 0.220362 0.237375 0.229618 0.231748 0.224451 0.242834 0.255388 0.270816 0.256599 0.256326
chargesum: 0.00000
title: Mulliken charges with hydrogens summed into heavy atoms:
elementType: Cl S N C C C C C C C C C C C C C C C C
charge: -0.056050 -0.027962 -0.157594 0.450987 0.111054 -0.487445 -0.215129 0.480255 -0.170239 0.488860 0.034908 -0.200824 0.031504 -0.111942 -0.064009 -0.077882 0.036440 0.041329 -0.106261
polarizability: 2.40290328e+02 -1.72450490e+01 2.34098597e+02 -1.83208176e+01 -2.04209597e+01 1.60438685e+02
1716.lowfreq: -5.7748 -4.8179 -0.0017 0.0013 0.0022 5.4338 27.8617 37.3778 42.7606
frequency: 27.8143 37.3705 42.7214 52.5775 63.0756 70.6719 93.5915 107.3169 149.1857 199.5551 205.4738 212.3345 218.1539 249.0755 285.4532 295.1127 335.4998 346.3506 377.4233 408.9936 414.7538 445.7256 471.6415 488.4902 515.8333 518.2211 593.0210 614.2458 622.1264 641.4511 694.0870 705.6838 717.9892 737.4986 791.2748 803.2065 824.4824 834.4915 854.7909 891.9472 916.1408 931.7552 955.2525 967.2151 980.4000 982.0334 988.3063 1000.4335 1004.4276 1050.3214 1072.5625 1075.2748 1092.5214 1096.7877 1117.7388 1120.9856 1173.0335 1181.3502 1185.9136 1230.0854 1261.7867 1286.1781 1293.4530 1306.8179 1351.7585 1358.9987 1376.3417 1381.1937 1386.8578 1395.0972 1399.4452 1426.1425 1453.2347 1465.4342 1471.0748 1473.0482 1475.0007 1483.2664 1484.3492 1573.6536 1590.8505 1594.2533 1611.0212 2980.3456 2989.3817 3017.7359 3060.5944 3076.2535 3088.4356 3088.8924 3104.5887 3127.3668 3140.1782 3141.3021 3151.4291 3154.9700 3160.4219 3173.3170 3176.9270
redmass: 5.5297 5.3207 2.5375 1.2027 4.2108 3.6241 4.1799 4.9417 6.2295 4.0691 2.0349 3.1303 2.2250 3.4845 6.1038 4.9072 4.6772 2.5461 4.6150 2.9073 4.2888 3.1887 4.9454 4.7303 4.9865 3.3925 4.2333 6.5963 4.8299 6.3023 4.6040 2.2973 3.6583 2.7791 1.4408 1.6282 1.2914 1.5491 3.2221 1.3143 1.4374 2.7566 1.3547 1.3768 1.4641 2.9904 5.0890 1.9184 2.7103 1.5671 2.8043 2.6036 1.8558 1.6532 1.6826 1.5607 2.5873 1.0974 1.1259 2.9992 2.2104 1.8407 1.3055 1.3708 1.2946 4.2520 6.1412 1.2843 3.0777 3.5420 1.2367 2.6360 1.1427 1.0445 1.1015 2.1129 1.6058 1.4324 1.1505 7.5094 6.3312 5.8850 6.4309 1.0376 1.0352 1.0593 1.0970 1.1019 1.0998 1.0993 1.1027 1.0862 1.0920 1.0922 1.0891 1.0882 1.0995 1.0962 1.0975
irintensity: 0.1466 0.5643 1.1801 0.5151 0.6813 0.2642 1.2669 0.1058 1.1367 1.3093 0.4930 2.2086 0.7237 3.0074 0.2918 1.0534 5.1525 3.5012 2.1933 0.2542 9.1711 12.2222 5.8230 7.5983 3.0752 8.8682 2.1190 2.5144 3.3834 3.6535 2.6410 38.1487 2.1416 3.3368 61.3603 15.1921 17.6157 52.3789 16.8305 3.7140 2.7513 7.5407 1.8580 1.1779 2.1726 13.3215 2.0817 17.9509 19.7221 13.8277 42.1763 29.2427 44.1948 7.4226 26.1605 21.3080 11.5298 1.1193 3.7843 38.0930 44.1281 98.9471 6.4602 11.1114 1.9117 6.9996 16.6948 24.6777 153.5681 70.6063 15.7011 7.2785 43.1493 8.4417 18.3926 15.2584 17.4426 65.9021 7.2092 5.1754 51.7090 21.6202 37.6788 24.0866 29.0862 26.6266 16.6375 3.7062 34.5045 15.4747 16.8808 2.4096 19.8933 6.2244 0.4925 3.4621 17.2424 5.8000 0.7881
temp: 298.150 k
press: 1.00000 atm
elementType: 17 16 7 6 6 6 6 6 6 6 6 6 6 6 6 6 6 6 6 1 1 1 1 1 1 1 1 1 1 1 1 1 1 1 1
symmnumber: 1
zpe: 721423.9 jmol-1
zpe.correction: 0.274776 hartree
zpe.thermalcorrener: 0.293367 hartree
zpe.thermalcorrenthalpy: 0.294311 hartree
zpe.thermalcorrgfe: 0.225817 hartree
zpe.sumelectzpe: -1530.824646 hartree
zpe.sumelectthermal: -1530.806055 hartree
zpe.sumelectthermalent: -1530.805110 hartree
zpe.sumelectthermalfe: -1530.873605 hartree
dipole: 2.8613 4.1765 -0.2735
dipole: 5.0700
quadrupole: -129.4869 -132.7647 -116.4701
quadrupole: 3.0525 -6.3113 -0.9093
quadrupole: -3.2463 -6.5241 9.7704 3.0525 -6.3113 -0.9093
hfenergy: -1531.0994217 hartree
pointgroup: C01 [X(C16H16Cl1N1S1)]
dipole: -1.3862563 1.3236008 0.5524861 debye
polarizability: 225.3137697|24.5416301|234.2131439|-28.152585|24.9012126|175.3006958 unknown
InChI: InChI=1S/C16H16ClNS/c1-3-18(15-6-4-5-12(2)11-15)16(19)13-7-9-14(17)10-8-13/h4-11H,3H2,1-2H3
charge 0 multiplicity 1
35 atoms
Cl 5.043281 1.420982 -0.462971
S  -0.056648 -3.467119 -1.071245
N  -1.257195 -1.396594 0.256755
C  -1.489902 0.021738 0.477367
C  -2.430855 -2.291448 0.4956
C  -0.130266 -1.886394 -0.385779
C  -1.35418 0.936613 -0.59227
C  -1.595029 2.320561 -0.403126
C  -1.899699 0.478876 1.754073
C  1.097373 -1.027232 -0.406832
C  -3.440431 -2.256828 -0.668756
C  -2.00251 2.767504 0.879172
C  -2.155588 1.852157 1.946442
C  -1.414897 3.294083 -1.554432
C  1.524318 -0.31351 0.74672
C  1.910021 -0.989368 -1.570358
C  2.728147 0.421718 0.740878
C  3.103913 -0.240024 -1.600325
C  3.494781 0.456864 -0.439678
H  -2.03869 -3.314467 0.625574
H  -2.913496 -1.966714 1.433741
H  -1.055167 0.56462 -1.578579
H  -1.995672 -0.225258 2.587573
H  -3.822204 -1.234166 -0.83775
H  -2.966187 -2.623666 -1.59448
H  -4.299573 -2.912169 -0.437195
H  -2.201391 3.833097 1.041742
H  -2.467922 2.211645 2.933071
H  -1.916157 2.934213 -2.471323
H  -1.824354 4.289233 -1.311056
H  -0.343506 3.42319 -1.799479
H  0.928978 -0.348418 1.663621
H  1.602433 -1.569324 -2.446159
H  3.06181 0.95379 1.636163
H  3.721363 -0.206884 -2.502298
