program: Gaussian 09
title: 000292059
version: EM64L-G09RevD.01
frameworkgroup: C1[X(C13H17NO3S)]
method: RPBEPBE
basis: SDD
operation: Freq
keyword: #p
keyword: freq=noraman
keyword: PBEPBE/SDD
title: #p freq=noraman PBEPBE/SDD
converged: YES YES NO NO
title: Mulliken charges:
elementType: S O O O N C C C C C C C C C C C C C H H H H H H H H H H H H H H H H H
charge: -0.062773 -0.240766 -0.279105 -0.270079 -0.034380 -0.336881 -0.357369 -0.313935 -0.305979 -0.398625 0.336270 0.204665 -0.471912 0.334110 -0.329730 -0.367194 -0.541434 -0.539141 0.242511 0.238345 0.232668 0.254587 0.224970 0.194289 0.206555 0.225419 0.276776 0.242900 0.251479 0.244949 0.215003 0.230468 0.230966 0.243637 0.218735
chargesum: 0.00000
title: Mulliken charges with hydrogens summed into heavy atoms:
elementType: S O O O N C C C C C C C C C C C C C
charge: -0.062773 -0.240766 -0.279105 -0.270079 -0.034380 0.143975 0.129886 0.105324 0.125995 -0.398625 0.336270 0.204665 -0.195135 0.334110 -0.086830 -0.115715 0.148987 0.154197
polarizability: 2.16154733e+02 -7.88942869e+00 1.84754686e+02 -1.11738374e+01 -1.58712294e+01 1.42963335e+02
1716.lowfreq: -0.0007 -0.0006 0.0012 4.5642 5.9371 10.2201 30.8868 54.1000 64.2571
frequency: 30.8540 54.0909 64.2290 65.7105 76.6427 113.5626 132.5179 149.3969 157.6885 184.9567 220.9644 246.4459 253.0960 261.5395 277.6801 305.5717 325.2403 378.6640 388.9817 404.7425 421.7427 442.3644 460.1826 481.6425 503.1639 526.4376 597.6250 610.7954 638.9578 658.5735 708.0335 730.4568 781.9658 803.9194 806.7049 830.0258 865.5904 888.5595 904.5681 931.1901 979.8853 984.6898 1007.8577 1011.4876 1018.4634 1049.0741 1071.2939 1106.1070 1113.4492 1113.6423 1118.5689 1148.3194 1158.3516 1169.1353 1189.0582 1195.5435 1206.5331 1231.3269 1248.2671 1267.4759 1274.4341 1287.5438 1326.4197 1339.1708 1348.4887 1367.8021 1377.7079 1396.7043 1431.9621 1439.5222 1441.6552 1442.6554 1448.9882 1456.4311 1465.9725 1467.6855 1469.8213 1471.3612 1475.7654 1490.8214 1581.1334 1613.8111 2949.5210 2958.8298 2959.6776 2963.1149 2983.7014 3007.6109 3047.3904 3047.7866 3060.3629 3080.9938 3091.1397 3100.2637 3123.5890 3124.6876 3153.9431 3167.2109 3175.0566
redmass: 6.4192 5.3813 3.2641 3.0902 4.5008 3.8360 4.3761 4.1666 3.9579 2.8500 1.5393 1.9911 1.7247 2.2584 2.9616 3.2612 3.5075 4.7743 2.6834 4.7761 3.3433 3.7042 3.2495 3.3632 5.4728 4.1380 3.7865 2.3421 5.5800 5.7221 5.2158 3.8881 5.1848 3.7897 1.5691 1.6528 1.7868 3.0530 2.9631 1.3407 6.2524 7.9425 3.6281 2.4563 2.6987 2.0866 3.9486 2.1786 1.2630 1.2605 1.8923 1.6436 1.4547 1.6366 1.1043 2.1721 2.3489 1.7170 2.0278 1.7862 1.1947 1.8772 1.2662 1.2331 1.3612 1.2883 8.2431 3.1188 1.5048 1.2040 1.1167 1.2515 1.0822 1.0993 1.0568 1.1106 1.3631 1.5452 1.0636 1.8341 8.2136 6.4091 1.0678 1.0331 1.0333 1.0676 1.0604 1.0636 1.1037 1.1035 1.1012 1.0958 1.0982 1.0993 1.0996 1.0995 1.0871 1.0909 1.0966
irintensity: 0.6948 2.7530 1.3773 5.2909 1.2396 0.9840 0.7708 7.8000 6.5075 1.4315 2.1511 1.4376 2.0793 1.2793 6.7570 6.4421 6.8126 0.4921 1.4432 3.5366 0.8519 5.5405 0.9593 8.6769 13.9578 2.8309 4.3831 12.7417 2.8463 4.8454 32.0771 2.8422 5.2574 31.7828 30.5354 0.3560 21.3926 17.8773 15.2003 0.0309 18.0184 27.4629 99.8909 29.6019 31.4967 22.6833 30.1144 5.3307 0.4809 0.2038 8.5982 7.1387 6.2040 4.5248 12.2146 232.5534 56.4391 95.4335 6.9283 68.3430 18.0230 77.9188 3.0669 3.3786 6.6521 1.7095 17.3482 37.2133 135.7080 3.3860 9.5043 24.5901 2.3921 7.9882 21.2517 59.9879 13.9811 253.3381 5.4968 55.9207 2.0471 18.5314 47.9063 126.2694 5.5396 48.9615 45.7928 30.7451 35.0455 50.0250 16.4319 34.6916 33.8088 9.7034 20.8090 26.7900 7.7592 2.6231 8.7777
temp: 298.150 k
press: 1.00000 atm
elementType: 16 8 8 8 7 6 6 6 6 6 6 6 6 6 6 6 6 6 1 1 1 1 1 1 1 1 1 1 1 1 1 1 1 1 1
symmnumber: 1
zpe: 738600.4 jmol-1
zpe.correction: 0.281318 hartree
zpe.thermalcorrener: 0.299108 hartree
zpe.thermalcorrenthalpy: 0.300052 hartree
zpe.thermalcorrgfe: 0.234984 hartree
zpe.sumelectzpe: -1182.657584 hartree
zpe.sumelectthermal: -1182.639794 hartree
zpe.sumelectthermalent: -1182.638850 hartree
zpe.sumelectthermalfe: -1182.703918 hartree
dipole: 0.3403 2.3579 -2.6138
dipole: 3.5366
quadrupole: -117.3573 -93.2630 -123.2574
quadrupole: -2.5797 -4.5630 4.9258
quadrupole: -6.0647 18.0296 -11.9649 -2.5797 -4.5630 4.9258
hfenergy: -1182.9389022 hartree
pointgroup: C01 [X(C13H17N1O3S1)]
dipole: -0.2764661 -0.495741 -1.2703426 debye
polarizability: 210.925431|-18.3232486|176.1433776|10.9696802|24.0625248|156.8039457 unknown
InChI: InChI=1S/C13H17NO3S/c1-15-10-3-4-12(16-2)11(9-10)13(18)14-5-7-17-8-6-14/h3-4,9H,5-8H2,1-2H3
charge 0 multiplicity 1
35 atoms
S  0.806098 0.653563 2.676178
O  4.204589 0.313567 -1.315696
O  -0.285218 -2.232762 -0.152002
O  -3.655962 2.293006 -0.153869
N  1.826804 -0.158487 0.269969
C  1.818387 -0.402527 -1.192726
C  3.177177 -0.297644 0.865091
C  2.861397 0.5065 -1.878844
C  4.182277 0.606234 0.130218
C  0.722923 0.167983 1.019095
C  -0.625907 0.097219 0.362523
C  -1.143348 -1.115206 -0.182136
C  -1.45806 1.244789 0.389363
C  -2.768141 1.203896 -0.136153
C  -2.463728 -1.154642 -0.697658
C  -3.269377 -0.001921 -0.682081
C  -0.854061 -3.531755 -0.518397
C  -3.20418 3.534847 0.478275
H  0.816352 -0.195962 -1.598931
H  2.057869 -1.46658 -1.377333
H  3.487328 -1.35703 0.769106
H  3.108122 -0.030832 1.934193
H  2.947494 0.252184 -2.948288
H  2.556802 1.571078 -1.775514
H  3.922513 1.673729 0.294211
H  5.208176 0.417994 0.485549
H  -1.055935 2.144684 0.862397
H  -2.8746 -2.081965 -1.106811
H  -4.290467 -0.019907 -1.074371
H  -0.045842 -4.257393 -0.344407
H  -1.155137 -3.559721 -1.584262
H  -1.72362 -3.781324 0.119504
H  -2.967522 3.377623 1.548374
H  -4.049897 4.231413 0.381776
H  -2.31741 3.95185 -0.038544
