program: Gaussian 09
title: 000292048
version: EM64L-G09RevD.01
frameworkgroup: C1[X(C11H10N2O3)]
method: RPBEPBE
basis: SDD
operation: Freq
keyword: #p
keyword: freq=noraman
keyword: PBEPBE/SDD
title: #p freq=noraman PBEPBE/SDD
converged: YES YES NO NO
title: Mulliken charges:
elementType: O O O N N C C C C C C C C C C C H H H H H H H H H H
charge: -0.430153 -0.246771 -0.241551 -0.440364 -0.384724 0.270778 0.094860 0.273937 0.114991 -0.491257 0.124911 -0.401467 -0.383538 -0.218846 -0.223852 -0.226949 0.358327 0.282403 0.201043 0.365396 0.262337 0.260584 0.239984 0.241815 0.242106 0.355999
chargesum: 0.00000
title: Mulliken charges with hydrogens summed into heavy atoms:
elementType: O O O N N C C C C C C C C C C C
charge: -0.074154 -0.246771 -0.241551 -0.082037 -0.019328 0.270778 0.094860 0.273937 0.114991 -0.007811 0.124911 -0.139130 -0.122955 0.021138 0.017964 0.015157
polarizability: 1.99904575e+02 -9.01094243e+00 1.46771291e+02 -7.41175471e-01 -1.63071039e+01 8.49077449e+01
1716.lowfreq: -7.9403 0.0008 0.0008 0.0009 3.9811 7.5457 38.6098 60.8188 74.4643
frequency: 38.3367 60.8155 74.4405 79.8422 121.5212 164.3607 203.1891 241.8869 248.5607 290.5059 310.2061 344.1346 367.0254 401.8019 407.6709 480.3703 515.5650 541.8760 608.4023 628.4798 631.9795 641.6076 652.5183 705.1867 708.6763 733.3044 761.8635 778.9600 793.6261 858.7978 862.6917 933.7958 935.3083 976.4864 984.8119 990.7522 1003.1736 1008.6148 1028.8823 1084.7930 1093.7496 1173.2574 1178.4736 1193.5758 1196.8188 1224.5367 1285.1127 1312.7524 1319.0794 1351.2254 1374.2409 1375.4463 1387.9309 1430.7651 1452.0205 1477.4787 1485.3258 1581.0436 1602.0161 1612.5489 1627.4983 1680.7342 2960.0000 3095.9358 3129.9426 3137.5265 3148.6521 3158.9144 3173.4222 3529.3861 3546.8894 3548.0208
redmass: 3.9623 6.9012 4.6134 6.1087 4.3557 7.8255 6.3955 4.9814 4.3893 2.5519 4.8762 1.8294 3.4301 2.9183 6.9137 4.9374 6.1593 7.8690 5.9000 3.6517 4.6954 1.4097 6.0656 1.9389 2.4368 3.5182 2.3967 2.1647 3.2871 3.5219 1.4576 1.9395 1.6535 3.6023 1.9322 2.8251 1.9923 1.7408 2.1401 1.6939 2.3616 1.8643 1.0695 1.1512 4.2088 2.6748 2.5174 1.3016 1.3869 1.9999 3.2170 1.8988 1.8872 2.2874 2.5810 1.0880 2.5148 5.7155 6.4553 6.3088 7.4899 5.5691 1.0705 1.0919 1.0876 1.0869 1.0918 1.0963 1.1016 1.0771 1.0659 1.0778
irintensity: 0.1179 0.6597 0.9009 0.6436 4.8286 4.8310 0.8148 3.4214 3.0145 26.7829 0.7493 86.5941 14.8497 0.9580 15.3206 1.9209 27.6005 7.4830 3.5473 0.5068 8.8139 66.7557 5.6788 40.9080 2.2891 32.7573 16.2588 164.5536 23.8073 1.0026 2.5291 31.2915 36.1627 24.1055 1.7989 0.8112 9.1254 7.9171 4.5427 10.8149 12.7576 69.3279 2.1966 5.1901 21.7906 12.7753 9.3562 9.8823 1.6646 47.5097 2.2637 53.0222 85.9728 12.3929 98.5428 15.6291 12.7469 4.7526 41.0546 69.0132 413.1265 732.4109 50.5990 1.5131 3.2357 0.1052 6.5061 19.9045 16.4117 69.1252 6.4970 62.7751
temp: 298.150 k
press: 1.00000 atm
elementType: 8 8 8 7 7 6 6 6 6 6 6 6 6 6 6 6 1 1 1 1 1 1 1 1 1 1
symmnumber: 1
zpe: 514688.2 jmol-1
zpe.correction: 0.196034 hartree
zpe.thermalcorrener: 0.209735 hartree
zpe.thermalcorrenthalpy: 0.210679 hartree
zpe.thermalcorrgfe: 0.154794 hartree
zpe.sumelectzpe: -759.236496 hartree
zpe.sumelectthermal: -759.222796 hartree
zpe.sumelectthermalent: -759.221852 hartree
zpe.sumelectthermalfe: -759.277737 hartree
dipole: 6.3754 -1.9168 -1.5860
dipole: 6.8436
quadrupole: -88.5914 -108.9023 -92.7115
quadrupole: -2.8961 -1.1635 -9.3950
quadrupole: 8.1437 -12.1672 4.0235 -2.8961 -1.1635 -9.3950
hfenergy: -759.4325305 hartree
pointgroup: C01 [X(C11H10N2O3)]
dipole: 2.5443985 0.8404997 0.2628564 debye
dipolederiv: -0.4739262 0.3485494 0.1029017 0.190039 -0.5942549 0.0959122 0.1118951 -0.0651742 -0.4993605 -1.025854 -0.4048966 0.1897049 -0.3229941 -0.8190354 0.1922494 0.1388666 0.1940484 -0.4398676 -0.7367882 0.3624442 -0.1320711 0.4740444 -1.1751931 0.2874727 -0.1688039 0.2928686 -0.4874749 -1.0386637 0.7066707 -0.2356236 0.0308016 -0.8239029 0.206464 0.0367622 0.2254918 -0.3506194 -0.4494323 -0.0324248 0.0230366 0.0882815 -1.1315368 0.3050228 -0.0426314 0.3290275 -0.4582866 0.7046859 -0.1189284 0.0220115 0.1886236 0.8653379 -0.2752605 -0.1704836 -0.3128883 0.1613045 -0.9691509 -0.3592849 0.185616 -0.0503299 -0.3100352 0.0644182 0.08828 0.1037162 -0.1937663 0.0104787 0.0818494 -0.0177955 0.0399129 -0.0323177 -0.0241497 0.0233038 0.0093857 0.0115123 1.604205 0.3362513 -0.1895303 0.0691637 1.1453978 -0.3814529 -0.0112313 -0.4175189 0.4207597 0.3517538 -0.2114472 -0.0882743 -0.1553516 0.4745334 -0.0062465 -0.0697432 0.0751086 0.4242194 1.4533319 -0.5519448 0.1813335 -0.4376029 1.5895233 -0.4839876 0.1216185 -0.5004285 0.5017916 -0.0847278 -0.0207838 0.0939161 0.0817601 -0.1457844 -0.0224937 0.0056603 -0.0458703 0.0229488 -0.0901178 -0.0024862 -0.0681649 -0.0973982 -0.1523741 -0.0333688 0.0233685 -0.0442474 -0.0063697 -0.0441504 0.0306023 -0.1011025 0.0322527 -0.1064725 -0.0682212 -0.1228192 -0.0768 0.0765018 -0.0317638 -0.0239427 0.1026362 -0.0287577 -0.1091555 -0.0674241 0.1330784 -0.0620732 0.0610587 0.1036677 -0.001426 -0.0035063 0.0072699 -0.1297529 -0.0313857 -0.0096236 -0.02522 -0.0655501 0.2315546 0.0196113 0.0012571 -0.0309714 0.2308663 0.0254751 -0.0259373 0.0422345 0.2772141 0.0437795 -0.1022709 0.0462504 -0.0357299 0.0757489 -0.0070495 -0.0217322 -0.0188197 0.0984245 0.0151562 0.1128713 -0.1206006 0.045725 0.004238 -0.0425553 -0.0487339 -0.0141157 -0.1589512 0.2454041 0.0046456 0.0018144 -0.0032385 0.1708599 0.0650653 0.0102304 0.0791834 0.3062153 0.0493552 0.0275413 -0.086898 0.0088649 0.1260119 0.04446 -0.0906144 0.0430908 0.0100067 0.0662379 -0.0227179 0.0848892 -0.0026915 0.1236867 0.0647333 0.0755501 0.0556644 0.0067484 0.0286893 -0.0290624 0.0659793 -0.035048 0.1331612 0.0651647 0.085094 0.0697331 -0.0287632 0.0184838 0.0159778 -0.0677785 0.0341233 0.1374218 0.061022 -0.088901 0.0564301 -0.0184653 -0.1079905 -0.0108884 0.0051855 -0.0091 0.1509722 0.0238746 0.0042777 0.0209896 0.102688 0.125782 -0.1545095 0.0048132 -0.0816489 0.3020561 -0.0577388 0.0132693 -0.0138165 0.2260808 unknown
polarizability: 200.2850498|5.5155877|126.7406631|-5.3201517|-33.024309|104.5578985 unknown
InChI: InChI=1S/C11H10N2O3/c14-6-8-9(7-4-2-1-3-5-7)12-11(16)13-10(8)15/h1-5,12-14H,6H2
charge 0 multiplicity 1
26 atoms
O  0.445051 -2.802915 -0.172767
O  -3.315409 -1.584088 0.797361
O  -2.722726 2.712289 -0.960337
N  -0.846011 1.396126 -0.477966
N  -2.986705 0.5449 -0.082378
C  -0.244671 0.211108 -0.024984
C  -1.028755 -0.847945 0.404751
C  1.247648 0.224521 -0.067881
C  -2.496339 -0.700887 0.40747
C  -0.490913 -2.218863 0.797317
C  -2.233035 1.630184 -0.542399
C  1.923928 0.677482 -1.234268
C  2.013707 -0.167273 1.063444
C  3.334195 0.723552 -1.271382
C  3.42403 -0.116174 1.024061
C  4.088961 0.327843 -0.142812
H  -0.259506 2.189362 -0.747082
H  -1.346216 -2.911258 0.829025
H  -0.041377 -2.200734 1.81211
H  -4.005053 0.658716 -0.100023
H  1.348472 0.95479 -2.125517
H  1.504559 -0.486202 1.979169
H  3.842283 1.059761 -2.181298
H  4.001083 -0.415164 1.905422
H  5.183019 0.364763 -0.172237
H  1.289783 -2.283793 -0.171001
