program: Gaussian 09
title: 000292037
version: EM64L-G09RevD.01
frameworkgroup: C1[X(C11H9N3O)]
method: RPBEPBE
basis: SDD
operation: Freq
keyword: #p
keyword: freq=noraman
keyword: PBEPBE/SDD
title: #p freq=noraman PBEPBE/SDD
converged: NO NO NO NO
title: Mulliken charges:
elementType: O N N N C C C C C C C C C C C H H H H H H H H H
charge: -0.231462 -0.307621 -0.415110 0.019725 0.244848 0.243964 0.082749 0.462902 -0.286942 -0.353130 -0.483825 -0.785020 -0.256975 -0.208659 -0.011458 0.344343 0.247050 0.244023 0.251498 0.251527 0.240990 0.240978 0.231041 0.234564
chargesum: 0.00000
title: Mulliken charges with hydrogens summed into heavy atoms:
elementType: O N N N C C C C C C C C C C C
charge: -0.231462 -0.307621 -0.070767 0.019725 0.244848 0.243964 0.082749 0.462902 -0.039892 -0.109108 -0.232327 -0.051525 -0.025934 0.025904 -0.011458
polarizability: 2.49467488e+02 -6.92873771e+00 1.40194247e+02 1.46148073e-02 -6.45508434e-03 5.88784365e+01
1716.lowfreq: -4.4527 0.0005 0.0007 0.0007 9.5336 10.2281 60.9202 105.9620 166.0644
frequency: 60.8909 105.9012 166.0622 203.6337 207.1687 253.0894 276.0428 304.1690 331.7139 366.5965 428.9237 433.2823 520.1370 539.5086 549.0597 570.5571 575.8000 589.9969 603.2459 682.1459 686.6579 732.8690 733.6994 745.4615 751.2432 843.8174 850.3130 874.4436 912.6119 927.2324 960.0431 974.0388 1012.3341 1027.0221 1052.7711 1065.1216 1117.7108 1152.3829 1176.0499 1204.5333 1235.4577 1249.0725 1298.0288 1309.3667 1353.1590 1398.6890 1407.3600 1422.5084 1468.6818 1468.8898 1473.0286 1486.3730 1546.5229 1603.8740 1620.6259 1631.4753 1658.6776 2982.7174 3062.7318 3115.9552 3141.8204 3154.3332 3171.3039 3180.9068 3199.1374 3620.2121
redmass: 5.6425 3.8314 4.8303 5.4615 4.9482 1.0917 4.6989 3.1793 5.8045 7.5597 6.9290 3.2454 5.8302 3.8086 7.0814 1.8987 1.6710 7.3866 4.4421 5.1530 5.7077 6.8980 3.6929 3.9485 1.5105 5.7223 1.3948 1.4507 5.4938 1.3761 2.4843 1.3054 5.1062 2.0493 1.5166 2.1788 1.8761 5.4538 1.1144 2.4451 1.5220 1.8556 2.7117 2.8673 2.4222 2.0942 1.8349 3.2510 1.0449 1.4189 2.8387 2.4037 7.7005 7.1960 8.0703 7.4364 8.6538 1.0388 1.0984 1.0970 1.0861 1.0918 1.0984 1.0926 1.0945 1.0812
irintensity: 3.2309 0.7188 0.9574 0.2512 1.0044 1.3749 3.0872 0.9955 0.5101 5.3955 4.7791 5.6860 2.6622 0.3376 7.5095 39.9096 87.5045 1.3403 0.2949 0.5341 2.2074 6.1473 6.1663 13.2800 100.6703 8.1134 1.0632 26.9146 16.2888 3.1897 0.8722 0.1056 12.9602 7.0251 6.6686 12.2043 1.5929 35.0214 7.6757 60.6618 1.0458 5.6197 42.9182 36.6769 35.6122 35.8472 82.2616 6.0066 19.1152 43.9083 23.2608 66.7093 627.9866 42.7702 84.0896 26.4805 576.7318 11.1635 12.5486 13.8243 0.4886 11.8503 18.4202 2.9410 5.3834 94.8520
temp: 298.150 k
press: 1.00000 atm
elementType: 8 7 7 7 6 6 6 6 6 6 6 6 6 6 6 1 1 1 1 1 1 1 1 1
symmnumber: 1
zpe: 477484.6 jmol-1
zpe.correction: 0.181864 hartree
zpe.thermalcorrener: 0.193184 hartree
zpe.thermalcorrenthalpy: 0.194128 hartree
zpe.thermalcorrgfe: 0.144833 hartree
zpe.sumelectzpe: -663.030819 hartree
zpe.sumelectthermal: -663.019499 hartree
zpe.sumelectthermalent: -663.018555 hartree
zpe.sumelectthermalfe: -663.067851 hartree
dipole: -8.1422 3.0852 -0.0017
dipole: 8.7071
quadrupole: -108.6654 -72.3831 -90.2410
quadrupole: 15.5355 -0.0105 0.0001
quadrupole: -18.2355 18.0467 0.1888 15.5355 -0.0105 0.0001
hfenergy: -663.2126834 hartree
pointgroup: C01 [X(C11H9N3O1)]
dipole: 3.2008442 -1.220537 -0.0006524 debye
dipolederiv: -1.5817281 0.1850054 -0.0002082 0.2717963 -0.5023049 0.0000901 0.0012735 -0.0000964 -0.38407 -1.2399488 0.1397785 0.0000056 -0.2182377 -0.7929396 -0.0000214 0.0002353 -0.0000781 0.0259809 -1.2828457 0.0630696 0.0000702 -0.1505194 -0.4650855 0.0000804 -0.0001736 0.0001808 -0.33715 -1.8287575 -0.0053265 0.0001934 -0.2795204 -0.4681274 0.0001779 0.0000401 -0.0000625 -0.2882361 0.8939755 -0.0634249 -0.0000393 0.3832555 -0.1056218 -0.0000143 0.0000339 -0.0000439 0.0376233 0.4223499 -0.3546027 -0.0000365 -0.7756055 0.2193471 0.0000219 -0.0001183 0.0000067 0.0603835 1.9708918 -0.133448 -0.0000296 -0.0161581 0.7649013 0.0000315 -0.0001461 0.0000668 0.1716481 0.9391175 0.0692092 0.0000505 0.4316788 0.5607462 -0.0001069 -0.000228 0.0000189 0.0065003 0.0680723 -0.0111093 0.0000021 -0.0143929 0.0462191 0.0000113 0.0000218 0.0000308 -0.1456888 0.0548883 0.1438064 0.0000047 -0.0118464 0.064485 0.0000237 0.0000326 0.0000058 -0.184678 -0.5340215 0.1702225 -0.0000027 0.431308 -0.3675938 -0.000153 0.0001143 0.0001373 -0.1862234 -0.0110274 0.0819331 0.0000282 0.0083159 -0.156256 0.0000089 -0.0001061 -0.0000404 0.074813 -0.2100982 -0.0275931 0.0000087 -0.223385 0.0089075 0.0000311 -0.0000137 0.0000152 -0.181648 -0.051592 -0.0246189 0.0000051 0.2621124 0.0208104 0.0000049 0.0000307 0.0000167 -0.1516208 2.1088052 -0.1360089 -0.0000528 -0.0387646 0.8075774 -0.0001062 -0.0009887 -0.0001445 0.2200842 0.1422849 -0.0012358 0.0000011 0.0102283 0.2894543 -0.0000312 -0.0000267 -0.000092 0.3617666 0.1114778 -0.0555824 -0.0000161 -0.0437534 -0.0500565 -0.0000209 -0.0000156 -0.0000295 0.1551465 0.083357 -0.0163649 0.0000019 -0.0521286 -0.072681 -0.000024 -0.0000076 -0.000025 0.1777612 0.0470379 -0.0683414 0.000007 -0.0695861 -0.0234783 0.0000312 0.0000494 0.0000727 0.1621572 -0.0512118 -0.1522001 -0.0000003 -0.0401653 0.0413898 0.0000011 0.0000074 0.0000274 0.1210776 0.0419101 0.0764582 -0.1056103 0.0369538 0.0549937 -0.0040201 -0.0996908 0.0198327 -0.0230253 0.0419295 0.0764696 0.1056064 0.0369216 0.055019 0.0040092 0.0996773 -0.0197775 -0.0229777 -0.0234817 0.0889733 0.0000114 0.1051791 -0.0122167 -0.0000195 0.0000094 -0.0000165 0.1656522 -0.1113849 -0.0450689 -0.0000005 -0.0436864 0.0825107 -0.0000058 -0.0000103 -0.0000051 0.1647236 unknown
polarizability: 249.4378516|-7.1585625|140.2238834|-0.0146012|0.0064858|58.8784365 unknown
InChI: InChI=1S/C11H9N3O/c1-7-6-10(15)13-11-12-8-4-2-3-5-9(8)14(7)11/h2-6,12H,1H3
charge 0 multiplicity 1
24 atoms
O  -4.290735 0.775811 0.001056
N  -0.323371 -0.337505 -0.00026
N  0.355022 1.813411 -0.000011
N  -2.029729 1.438893 -0.00014
C  1.100381 -0.347519 -0.000246
C  1.514491 1.023991 -0.00007
C  -0.787739 1.014758 -0.00011
C  -1.300113 -1.357756 -0.000151
C  2.060625 -1.379326 -0.000352
C  2.871717 1.387909 -0.000067
C  -2.621369 -0.965031 -0.000136
C  -0.853528 -2.79767 0.00005
C  3.428156 -1.012692 -0.000312
C  3.82922 0.346375 -0.000179
C  -3.067607 0.448997 -0.000678
H  0.295006 2.82909 0.000397
H  1.782702 -2.434351 -0.000472
H  3.179341 2.438151 0.000026
H  -3.40561 -1.726199 0.000178
H  -1.738389 -3.451922 0.000091
H  -0.250319 -3.037788 0.895333
H  -0.250212 -3.038021 -0.895099
H  4.188146 -1.800665 -0.00039
H  4.895012 0.596463 -0.000159
