program: Gaussian 09
title: 000292046
version: EM64L-G09RevD.01
frameworkgroup: C1[X(C12H11NO3)]
method: RPBEPBE
basis: SDD
operation: Freq
keyword: #p
keyword: freq=noraman
keyword: PBEPBE/SDD
title: #p freq=noraman PBEPBE/SDD
converged: YES YES NO NO
title: Mulliken charges:
elementType: O O O N C C C C C C C C C C C C H H H H H H H H H H H
charge: -0.186891 -0.265129 -0.208841 -0.199823 -0.126449 0.169848 0.379939 0.427252 0.171424 -0.795514 -0.799176 -0.353278 -0.393916 -0.211224 -0.190127 -0.251533 0.234083 0.295511 0.247615 0.230791 0.312495 0.244879 0.301846 0.275555 0.228984 0.230511 0.231168
chargesum: 0.00000
title: Mulliken charges with hydrogens summed into heavy atoms:
elementType: O O O N C C C C C C C C C C C C
charge: -0.186891 -0.265129 -0.208841 -0.199823 -0.126449 0.169848 0.379939 0.427252 0.171424 -0.018305 -0.011010 -0.051433 -0.118361 0.017759 0.040384 -0.020364
polarizability: 2.65642402e+02 -1.12320895e+01 1.55889831e+02 2.94248554e-01 4.16585799e-01 6.58507969e+01
1716.lowfreq: -7.9460 -4.9760 -0.0008 -0.0005 -0.0002 5.6360 37.3592 43.3814 84.5574
frequency: 37.3093 43.3024 84.5548 93.3949 95.7255 105.4489 117.5998 196.3070 233.5389 256.6252 273.9950 301.0113 328.1261 355.2542 391.2651 404.9273 421.8987 490.4861 507.5215 537.8937 612.9078 626.0124 627.0839 642.7001 693.7611 694.3233 763.3117 768.7155 784.5046 848.5598 881.8354 923.8541 940.2684 954.2348 964.7989 981.6139 983.3021 997.0071 1013.8153 1028.9090 1079.0606 1084.9784 1099.7260 1147.4761 1174.5711 1191.3790 1211.5458 1276.8499 1318.2838 1349.1051 1382.1711 1386.1346 1394.7354 1443.8301 1448.4201 1454.8476 1460.8105 1479.3718 1480.7848 1584.4414 1599.9233 1607.1058 1641.8643 1701.2792 2967.4447 2974.1292 3041.8278 3048.6125 3122.4847 3128.1030 3133.5402 3144.7109 3164.7248 3188.3970 3193.5582
redmass: 4.2066 4.7084 1.1444 1.3927 3.3419 2.5363 3.8252 6.2329 4.7036 6.8508 5.2540 7.6256 5.6915 5.7629 4.2377 2.9519 3.7937 2.7787 3.2089 6.3923 6.4781 7.5049 10.0075 9.1985 10.5104 2.2562 1.6401 7.2990 7.4795 1.2458 5.6714 1.4049 1.3746 3.2507 1.5344 1.3566 6.1636 1.3006 3.8082 2.1612 2.4178 1.8172 2.1805 4.2495 1.0496 1.1410 3.4376 4.7857 1.6581 2.8853 9.0005 1.1949 1.1820 1.1113 2.3075 1.1532 1.0570 2.2330 1.0847 6.4022 9.4361 5.9590 5.9942 12.1279 1.0409 1.0420 1.0921 1.0918 1.0994 1.0985 1.0856 1.0909 1.0973 1.0950 1.0960
irintensity: 2.0846 1.6263 1.2343 1.0317 2.1313 0.2791 0.5313 0.2453 0.1120 2.1625 1.0090 0.1225 0.8632 20.8535 1.7976 0.0085 0.9799 12.7351 5.1186 2.4992 0.3330 9.0346 1.0056 5.6568 6.5284 33.3669 99.7155 0.7752 6.8975 0.0084 146.7359 11.4405 5.0185 32.9728 9.4879 0.0164 0.2553 1.9333 73.0611 1.6124 72.5787 16.2714 17.0882 6.3687 0.4022 1.9601 33.0580 5.3261 89.7540 216.0520 1.8885 47.3882 69.4706 40.7879 4.3115 51.2014 6.4920 132.0902 34.9971 5.9135 176.2704 73.3668 257.9385 280.4222 5.5976 21.6511 15.7001 15.0281 3.6824 1.3730 0.2359 20.2168 30.1184 1.2905 8.4818
temp: 298.150 k
press: 1.00000 atm
elementType: 8 8 8 7 6 6 6 6 6 6 6 6 6 6 6 6 1 1 1 1 1 1 1 1 1 1 1
symmnumber: 1
zpe: 533019.7 jmol-1
zpe.correction: 0.203016 hartree
zpe.thermalcorrener: 0.217785 hartree
zpe.thermalcorrenthalpy: 0.218729 hartree
zpe.thermalcorrgfe: 0.160246 hartree
zpe.sumelectzpe: -743.125351 hartree
zpe.sumelectthermal: -743.110582 hartree
zpe.sumelectthermalent: -743.109638 hartree
zpe.sumelectthermalfe: -743.168122 hartree
dipole: 1.7671 -1.6043 0.0124
dipole: 2.3868
quadrupole: -66.4202 -100.8546 -95.0059
quadrupole: -8.3279 0.0871 0.1077
quadrupole: 21.0067 -13.4277 -7.5790 -8.3279 0.0871 0.1077
hfenergy: -743.3283673 hartree
pointgroup: C01 [X(C12H11N1O3)]
dipole: 0.6769538 -0.6501797 0.0280738 debye
polarizability: 264.9059914|-14.3777036|156.4958202|-0.4986162|-3.3993717|65.9812184 unknown
InChI: InChI=1S/C12H11NO3/c1-8(2)10-11(14)13(16-12(10)15)9-6-4-3-5-7-9/h3-7H,1-2H3
charge 0 multiplicity 1
27 atoms
O  0.226568 1.477865 -0.085244
O  0.476975 -2.102764 0.075424
O  2.357631 2.378359 -0.131219
N  -0.322704 0.114671 -0.01962
C  1.98256 -0.101232 -0.023761
C  0.691975 -0.853711 0.016076
C  3.253706 -0.647016 -0.005765
C  -1.740024 0.039236 -0.001298
C  1.673761 1.342397 -0.082954
C  4.499558 0.20701 -0.017709
C  3.484903 -2.138412 0.027747
C  -2.379435 -1.23002 0.076667
C  -2.507374 1.232232 -0.061498
C  -3.788154 -1.283542 0.092392
C  -3.914672 1.149655 -0.043519
C  -4.56498 -0.103319 0.032973
H  5.24407 -0.223187 -0.713319
H  4.30582 1.258076 -0.273455
H  4.966008 0.180424 0.988361
H  4.288355 -2.380513 0.748574
H  2.572369 -2.705473 0.259566
H  3.850739 -2.46944 -0.966049
H  -1.776725 -2.138935 0.122736
H  -2.005105 2.200143 -0.121128
H  -4.279098 -2.261107 0.152456
H  -4.503055 2.072466 -0.090035
H  -5.658476 -0.159065 0.046204
